{"text_format":"1","workbook":"xlsx","n_sheets":10,"sheets":["HOME","Data","Figures","B&R","C&J","CB&P","B&R Type Curve","Confined","Perched","Flowchart"],"not_rendered":{"charts":18,"images":9,"macros":1,"external_links":0,"defined_names":119,"comments":2,"pivot_tables":0},"unopened":[],"bounds":{"document_bytes":16777216,"sheet_cells":100000,"rows_first":2000,"rows_last":500,"rows_between":2000,"halvings":0,"cell_chars":16384,"cell_head_chars":4096},"cells_cut":0,"cells_raw":0,"read":"whole","date_system":"1900"}

{"sheet":"HOME","index":0,"n_rows":21,"n_cols":9,"rows_kept":21,"cut":false,"hidden":false,"merged":[[11,1,11,4],[3,1,3,4],[5,6,5,10],[10,1,10,4]]}
[null,null,null,null,null,"API LNAPL Transmissivity Workbook"]
[null,null,null,null,null,"Calculation of LNAPL Transmissivity from Baildown Test Data"]
[]
[null,"STEP 1: RESET OUTPUT SUMMARY"]
[]
[null,null,null,null,null,null,"STEP 4: LNAPL TRANSMISSIVITY SUMMARY"]
[]
[]
[]
[]
[null,"STEP 2: ENTER DATA & VIEW FIGURES"]
[null,"STEP 3: CHOOSE WELL CONDITIONS",null,null,null,null,null,null,"Mean LNAPL Transmissivity (ft2/d)"]
[null,null,null,null,null,null,null,null,2.9922458337886781]
[]
[]
[null,null,null,null,null,null,null,null,"Standard Deviation (ft2/d)"]
[null,null,null,null,null,null,null,null,0.48270293551829135]
[]
[]
[null,null,null,null,null,null,null,null,"Coefficient of Variation"]
[null,null,null,null,null,null,null,null,0.16131794054738799]

{"sheet":"Data","index":1,"n_rows":83,"n_cols":22,"rows_kept":83,"cut":false,"hidden":false,"merged":[]}
["Well Designation:","YYY","Beckett and Lyverse (2002)"]
["Date:","date"," "," "]
[]
["Ground Surface Elev (ft msl)",0,"Enter These Data",null,"Drawdown"]
["Top of Casing Elev (ft msl)",0,null,null,"Adjustment"]
["Well Casing Radius, rc (ft):",{"$f":"2/24","v":8.3333333333333329E-2},"re1",null,"(ft)"]
["Well Radius, rw (ft):",{"$f":"8/24","v":0.33333333333333331},null,null,{"$f":"Figures!C28","v":0}]
["LNAPL Specific Yield, Sy:",0.17499999999999999]
["LNAPL Density Ratio, rr:",0.78]
["Top of Screen (ft bgs):",57]
["Bottom of Screen (ft bgs):",72]
["LNAPL Baildown Vol. (gal.):",9]
["Effective Radius, re3 (ft):",{"$f":"SQRT(B8*(B7^2-B6^2)+B6^2)","v":0.15866193970549808},"Calculated Parameters"]
["Effective Radius, re2 (ft):",{"$f":"SQRT(-Figures!U27*B6^2+(Figures!U27+1)*B13^2)","v":4.3615759942553303E-2}]
["Initial Casing LNAPL Vol. (gal.):",{"$f":"PI()*B6^2*(F21-E21)*7.48","v":1.9272536465759578}]
["Initial Filter LNAPL Vol. (gal.):",{"$f":"IF(E21<B10,PI()*(B7^2-B6^2)*B8*(F21-B10)*7.48,PI()*(B7^2-B6^2)*B8*(F21-E21)*7.48)","v":5.0590408222618883}]
[]
[null,null,"Enter Data Here",null,null,null,null,null,"Water Table","LNAPL",null,null,"LNAPL",null,null,null,null,null,null,null,"LNAPL","Ave."]
[null,null,null,null,null,null,null,null,"Depth","Drawdown",null,"Average ","Discharge","sn","bn","re",null,null,"DTP","DTW","Volume","re"]
[null,"Time (min)","DTP (ft btoc)","DTW (ft btoc)","DTP (ft bgs)","DTW (ft bgs)",null,null,"(ft)","sn (ft)",null,"Time (min)","Qn (ft3/d)","(ft)","(ft)","(ft)",null,null,"(ft bgs)","(ft bgs)","(gallons)","(ft)"]
["Initial Fluid Levels:",0,59.57,71.38,{"$f":"C21+B4-B5","v":59.57},{"$f":"D21+B4-B5","v":71.38},null,null,{"$f":"E21+(1-B$9)*(F21-E21)","v":62.168199999999999},null,null,null,null,null,{"$f":"F21-E21","v":11.809999999999995}]
[]
["Enter Test Data:",1,61.7,61.75,{"$f":"IF(B23>0,C23+B$4-B$5,NA())","v":61.7},{"$f":"IF(B23>0,D23+B$4-B$5,NA())","v":61.75},null,null,{"$f":"E23+(1-B$9)*(F23-E23)","v":61.711000000000006},{"$f":"E23-E$21-E$7","v":2.1300000000000026},null,null,null,null,{"$f":"F23-E23","v":4.9999999999997158E-2},null,null,null,null,null,0,{"$f":"MAX(V24:V81)/(MAX(L24:L81)-L24)","v":0.15866193970549808}]
[null,2,61.6,61.73,{"$f":"IF(B24>0,C24+B$4-B$5,NA())","v":61.6},{"$f":"IF(B24>0,D24+B$4-B$5,NA())","v":61.73},null,null,{"$f":"E24+(1-B$9)*(F24-E24)","v":61.628599999999999},2.0300000000000011,null,{"$f":"IF(B24>0,0.5*(B23+B24),0)","v":1.5},{"$f":"IF(B24>0,1440*PI()*P24^2*(E23-E24+F24-F23)/(B24-B23),NA())","v":9.1106186954102064},{"$f":"0.5*(J23+J24)","v":2.0800000000000018},{"$f":"F24-E24","v":0.12999999999999545},{"$f":"IF(B24>0,re(B$10,E24,F24,B$6,B$14,B$13), )","v":0.15866193970549808},null,null,{"$f":"(E23+E24)/2","v":61.650000000000006},{"$f":"(F23+F24)/2","v":61.739999999999995},{"$f":"U23+M24*(B24-B23)*7.48/1440","v":4.732460266782524E-2},0]
[null,3,61.53,61.71,61.53,61.71,null,null,61.569600000000001,1.9600000000000009,null,{"$f":"IF(B25>0,0.5*(B24+B25),0)","v":2.5},{"$f":"IF(B25>0,1440*PI()*P25^2*(E24-E25+F25-F24)/(B25-B24),NA())","v":5.6941366846319852},{"$f":"0.5*(J24+J25)","v":1.995000000000001},{"$f":"F25-E25","v":0.17999999999999972},{"$f":"IF(B25>0,re(B$10,E25,F25,B$6,B$14,B$13), )","v":0.15866193970549808},null,null,{"$f":"(E24+E25)/2","v":61.564999999999998},61.72,{"$f":"U24+M25*(B25-B24)*7.48/1440","v":7.6902479335219168E-2},{"$f":"IF(P25>0,V24+0.5*(P24+P25)*(L25-L24),0)","v":0.15866193970549808}]
[null,4,61.45,61.69,61.45,61.69,null,null,61.502800000000001,1.8800000000000026,null,3.5,6.8329640215572498,1.9200000000000017,0.23999999999999488,{"$f":"IF(B26>0,re(B$10,E26,F26,B$6,B$14,B$13), )","v":0.15866193970549808},null,null,61.49,61.7,0.112395931336086,{"$f":"IF(P26>0,V25+0.5*(P25+P26)*(L26-L25),0)","v":0.31732387941099616}]
[null,5,61.4,61.68,61.4,61.68,null,null,61.461599999999997,1.8299999999999983,null,4.5,4.5553093477059123,1.8550000000000004,0.28000000000000114,{"$f":"IF(B27>0,re(B$10,E27,F27,B$6,B$14,B$13), )","v":0.15866193970549808},null,null,61.424999999999997,61.685000000000002,0.13605823267000283,0.47598581911649424]
[null,6,61.35,61.67,61.35,61.67,null,null,61.420400000000001,1.7800000000000011,null,5.5,4.5553093477051032,1.8049999999999997,0.32000000000000028,{"$f":"IF(B28>0,re(B$10,E28,F28,B$6,B$14,B$13), )","v":0.15866193970549808},null,null,61.375,61.674999999999997,0.15972053400391545,0.63464775882199231]
[null,7,61.3,61.66,61.3,61.66,null,null,61.379199999999997,1.7299999999999969,null,6.5,4.5553093477051032,1.754999999999999,0.35999999999999943,{"$f":"IF(B29>0,re(B$10,E29,F29,B$6,B$14,B$13), )","v":0.15866193970549808},null,null,61.325000000000003,61.664999999999999,0.18338283533782807,0.79330969852749034]
[null,8,61.25,61.65,61.25,61.65,null,null,61.338000000000001,1.6799999999999997,null,7.5,4.5553093477051032,1.7049999999999983,0.39999999999999858,{"$f":"IF(B30>0,re(B$10,E30,F30,B$6,B$14,B$13), )","v":0.15866193970549808},null,null,61.274999999999999,61.655000000000001,0.20704513667174068,0.95197163823298836]
[null,9,61.2,61.64,61.2,61.64,null,null,61.296800000000005,1.6300000000000026,null,8.5,4.5553093477051032,1.6550000000000011,0.43999999999999773,{"$f":"IF(B31>0,re(B$10,E31,F31,B$6,B$14,B$13), )","v":0.15866193970549808},null,null,61.225000000000001,61.644999999999996,0.2307074380056533,1.1106335779384864]
[null,10,61.15,61.67,61.15,61.67,null,null,61.264400000000002,1.5799999999999983,null,9.5,9.1106186954110147,1.6050000000000004,0.52000000000000313,{"$f":"IF(B32>0,re(B$10,E32,F32,B$6,B$14,B$13), )","v":0.15866193970549808},null,null,61.174999999999997,61.655000000000001,0.27803204067348275,1.2692955176439844]
[null,20,61.12,61.71,61.12,61.71,null,null,61.2498,1.5499999999999972,null,15,0.79717913584841316,1.5649999999999977,0.59000000000000341,{"$f":"IF(B33>0,re(B$10,E33,F33,B$6,B$14,B$13), )","v":0.15866193970549808},null,null,61.134999999999998,61.69,0.3194410680078309,2.1419361860242239]
[null,26,61.1,61.8,61.1,61.8,null,null,61.253999999999998,1.5300000000000011,null,23,2.0878501176980708,1.5399999999999991,0.69999999999999574,{"$f":"IF(B34>0,re(B$10,E34,F34,B$6,B$14,B$13), )","v":0.15866193970549808},null,null,61.11,61.754999999999995,0.38451239667608744,3.4112317036682085]
[null,30,61.09,61.85,61.09,61.85,null,null,61.257200000000005,1.5200000000000031,null,28,1.7082410053895147,1.5250000000000021,0.75999999999999801,{"$f":"IF(B35>0,re(B$10,E35,F35,B$6,B$14,B$13), )","v":0.15866193970549808},null,null,61.094999999999999,61.825000000000003,0.42000584867695845,4.2045414021956988]
[null,40,61.05,61.92,61.05,61.92,null,null,61.241399999999999,1.4799999999999969,null,35,1.2527100706190044,1.5,0.87000000000000455,{"$f":"IF(B36>0,re(B$10,E36,F36,B$6,B$14,B$13), )","v":0.15866193970549808},null,null,61.07,61.885000000000005,0.48507717734522338,5.3151749801341852]
[null,50,61.02,62,61.02,62,null,null,61.235600000000005,1.4500000000000028,null,45,1.2527100706188425,1.4649999999999999,0.97999999999999687,{"$f":"IF(B37>0,re(B$10,E37,F37,B$6,B$14,B$13), )","v":0.15866193970549808},null,null,61.034999999999997,61.96,0.55014850601347998,6.9017943771891659]
[null,60,60.99,62.09,60.99,62.09,null,null,61.231999999999999,1.4200000000000017,null,55,1.3665928043116118,1.4350000000000023,1.1000000000000014,{"$f":"IF(B38>0,re(B$10,E38,F38,B$6,B$14,B$13), )","v":0.15866193970549808},null,null,61.005000000000003,62.045000000000002,0.62113541001522199,8.4884137742441474]
[null,70,60.97,62.11,60.97,62.11,null,null,61.220799999999997,1.3999999999999986,null,65,0.45553093477051032,1.4100000000000001,1.1400000000000006,{"$f":"IF(B39>0,re(B$10,E39,F39,B$6,B$14,B$13), )","v":0.15866193970549808},null,null,60.980000000000004,62.1,0.64479771134913466,10.075033171299129]
[null,80,60.95,62.14,60.95,62.14,null,null,61.211800000000004,1.3800000000000026,null,75,0.56941366846311758,1.3900000000000006,1.1899999999999977,{"$f":"IF(B40>0,re(B$10,E40,F40,B$6,B$14,B$13), )","v":0.15866193970549808},null,null,60.96,62.125,0.67437558801652442,11.661652568354111]
[null,90,60.94,62.17,60.94,62.17,null,null,61.210599999999999,1.3699999999999974,null,85,0.45553093477059126,1.375,1.230000000000004,{"$f":"IF(B41>0,re(B$10,E41,F41,B$6,B$14,B$13), )","v":0.15866193970549808},null,null,60.945,62.155000000000001,0.6980378893504412,13.248271965409092]
[null,100,60.93,62.2,60.93,62.2,null,null,61.209400000000002,1.3599999999999994,null,95,0.45553093477051032,1.3649999999999984,1.2700000000000031,{"$f":"IF(B42>0,re(B$10,E42,F42,B$6,B$14,B$13), )","v":0.15866193970549808},null,null,60.935000000000002,62.185000000000002,0.72170019068435387,14.834891362464074]
[null,1000,60.94,62.7,60.94,62.7,null,null,{"$f":"E43+(1-B$9)*(F43-E43)","v":61.327199999999998},1.3699999999999974,null,550,6.2002821677098807E-2,{"$f":"0.5*(J42+J43)","v":1.3649999999999984},{"$f":"F43-E43","v":1.7600000000000051},{"$f":"IF(B43>0,re(B$10,E43,F43,B$6,B$14,B$13), )","v":0.15866193970549808},null,null,60.935000000000002,62.45,1.0115633820247907,87.026073928465706]
[null,2450,61.05,62.92,61.05,62.92,null,null,61.461399999999998,1.4799999999999969,null,1725,8.6393797973718864E-3,1.4249999999999972,1.8700000000000045,{"$f":"IF(B44>0,re(B$10,E44,F44,B$6,B$14,B$13), )","v":0.15866193970549808},null,null,60.994999999999997,62.81,1.0766347106930514,273.45385308242595]
[null,3900,61.07,62.98,61.07,62.98,null,null,{"$f":"E45+(1-B$9)*(F45-E45)","v":61.490200000000002},1.5,null,3175,3.1415926535891675E-3,{"$f":"0.5*(J44+J45)","v":1.4899999999999984},{"$f":"F45-E45","v":1.9099999999999966},{"$f":"IF(B45>0,re(B$10,E45,F45,B$6,B$14,B$13), )","v":0.15866193970549808},null,null,61.06,62.95,1.1002970120269597,503.5136656553982]
[null,5350,60.88,62.95,60.88,62.95,null,null,{"$f":"E46+(1-B$9)*(F46-E46)","v":61.3354},{"$f":"E46-E$21-E$7","v":1.3100000000000023},null,4625,1.2566370614359461E-2,{"$f":"0.5*(J45+J46)","v":1.4050000000000011},{"$f":"F46-E46","v":2.0700000000000003},{"$f":"IF(B46>0,re(B$10,E46,F46,B$6,B$14,B$13), )","v":0.15866193970549808},null,null,{"$f":"(E45+E46)/2","v":60.975000000000001},{"$f":"(F45+F46)/2","v":62.965000000000003},{"$f":"U45+M46*(B46-B45)*7.48/1440","v":1.1949462173626144},733.57347822837039]
[null,29240,60.95,63.1,60.95,63.1,null,null,61.423000000000002,1.3800000000000026,null,17295,3.8135699855212251E-4,1.3450000000000024,2.1499999999999986,{"$f":"IF(B47>0,re(B$10,E47,F47,B$6,B$14,B$13), )","v":0.15866193970549808},null,null,60.915000000000006,63.025000000000006,1.2422708200304398,2743.8202542970312]
[null,54410,60.98,63.15,60.98,63.15,null,null,61.4574,1.4099999999999966,null,41825,9.049084917969631E-5,1.3949999999999996,2.1700000000000017,{"$f":"IF(B48>0,re(B$10,E48,F48,B$6,B$14,B$13), )","v":0.15866193970549808},null,null,60.965000000000003,63.125,1.2541019706973981,6635.7976352728992]
[null,null,null,null,{"$error":"#N/A"},{"$error":"#N/A"},null,null,{"$error":"#N/A"},{"$error":"#N/A"},null,0,{"$error":"#N/A"},{"$error":"#N/A"},{"$error":"#N/A"},{"$f":"IF(B49>0,re(B$10,E49,F49,B$6,B$14,B$13), )","v":0},null,null,{"$error":"#N/A"},{"$error":"#N/A"},{"$error":"#N/A"},0]
[null,null,null,null,{"$error":"#N/A"},{"$error":"#N/A"},null,null,{"$error":"#N/A"},{"$error":"#N/A"},null,0,{"$error":"#N/A"},{"$error":"#N/A"},{"$error":"#N/A"},{"$f":"IF(B50>0,re(B$10,E50,F50,B$6,B$14,B$13), )","v":0},null,null,{"$error":"#N/A"},{"$error":"#N/A"},{"$error":"#N/A"},0]
[null,null,null,null,{"$error":"#N/A"},{"$error":"#N/A"},null,null,{"$error":"#N/A"},{"$error":"#N/A"},null,0,{"$error":"#N/A"},{"$error":"#N/A"},{"$error":"#N/A"},{"$f":"IF(B51>0,re(B$10,E51,F51,B$6,B$14,B$13), )","v":0},null,null,{"$error":"#N/A"},{"$error":"#N/A"},{"$error":"#N/A"},0]
[null,null,null,null,{"$error":"#N/A"},{"$error":"#N/A"},null,null,{"$error":"#N/A"},{"$error":"#N/A"},null,0,{"$error":"#N/A"},{"$error":"#N/A"},{"$error":"#N/A"},{"$f":"IF(B52>0,re(B$10,E52,F52,B$6,B$14,B$13), )","v":0},null,null,{"$error":"#N/A"},{"$error":"#N/A"},{"$error":"#N/A"},0]
[null,null,null,null,{"$error":"#N/A"},{"$error":"#N/A"},null,null,{"$error":"#N/A"},{"$error":"#N/A"},null,0,{"$error":"#N/A"},{"$error":"#N/A"},{"$error":"#N/A"},{"$f":"IF(B53>0,re(B$10,E53,F53,B$6,B$14,B$13), )","v":0},null,null,{"$error":"#N/A"},{"$error":"#N/A"},{"$error":"#N/A"},0]
[null,null,null,null,{"$error":"#N/A"},{"$error":"#N/A"},null,null,{"$error":"#N/A"},{"$error":"#N/A"},null,0,{"$error":"#N/A"},{"$error":"#N/A"},{"$error":"#N/A"},{"$f":"IF(B54>0,re(B$10,E54,F54,B$6,B$14,B$13), )","v":0},null,null,{"$error":"#N/A"},{"$error":"#N/A"},{"$error":"#N/A"},0]
[null,null,null,null,{"$error":"#N/A"},{"$error":"#N/A"},null,null,{"$error":"#N/A"},{"$error":"#N/A"},null,0,{"$error":"#N/A"},{"$error":"#N/A"},{"$error":"#N/A"},{"$f":"IF(B55>0,re(B$10,E55,F55,B$6,B$14,B$13), )","v":0},null,null,{"$error":"#N/A"},{"$error":"#N/A"},{"$error":"#N/A"},0]
[null,null,null,null,{"$error":"#N/A"},{"$error":"#N/A"},null,null,{"$error":"#N/A"},{"$error":"#N/A"},null,0,{"$error":"#N/A"},{"$error":"#N/A"},{"$error":"#N/A"},{"$f":"IF(B56>0,re(B$10,E56,F56,B$6,B$14,B$13), )","v":0},null,null,{"$error":"#N/A"},{"$error":"#N/A"},{"$error":"#N/A"},0]
[null,null,null,null,{"$error":"#N/A"},{"$error":"#N/A"},null,null,{"$error":"#N/A"},{"$error":"#N/A"},null,0,{"$error":"#N/A"},{"$error":"#N/A"},{"$error":"#N/A"},{"$f":"IF(B57>0,re(B$10,E57,F57,B$6,B$14,B$13), )","v":0},null,null,{"$error":"#N/A"},{"$error":"#N/A"},{"$error":"#N/A"},0]
[null,null,null,null,{"$error":"#N/A"},{"$error":"#N/A"},null,null,{"$error":"#N/A"},{"$error":"#N/A"},null,0,{"$error":"#N/A"},{"$error":"#N/A"},{"$error":"#N/A"},{"$f":"IF(B58>0,re(B$10,E58,F58,B$6,B$14,B$13), )","v":0},null,null,{"$error":"#N/A"},{"$error":"#N/A"},{"$error":"#N/A"},0]
[null,null,null,null,{"$error":"#N/A"},{"$error":"#N/A"},null,null,{"$error":"#N/A"},{"$error":"#N/A"},null,0,{"$error":"#N/A"},{"$error":"#N/A"},{"$error":"#N/A"},{"$f":"IF(B59>0,re(B$10,E59,F59,B$6,B$14,B$13), )","v":0},null,null,{"$error":"#N/A"},{"$error":"#N/A"},{"$error":"#N/A"},0]
[null,null,null,null,{"$error":"#N/A"},{"$error":"#N/A"},null,null,{"$error":"#N/A"},{"$error":"#N/A"},null,0,{"$error":"#N/A"},{"$error":"#N/A"},{"$error":"#N/A"},{"$f":"IF(B60>0,re(B$10,E60,F60,B$6,B$14,B$13), )","v":0},null,null,{"$error":"#N/A"},{"$error":"#N/A"},{"$error":"#N/A"},0]
[null,null,null,null,{"$error":"#N/A"},{"$error":"#N/A"},null,null,{"$error":"#N/A"},{"$error":"#N/A"},null,0,{"$error":"#N/A"},{"$error":"#N/A"},{"$error":"#N/A"},{"$f":"IF(B61>0,re(B$10,E61,F61,B$6,B$14,B$13), )","v":0},null,null,{"$error":"#N/A"},{"$error":"#N/A"},{"$error":"#N/A"},0]
[null,null,null,null,{"$error":"#N/A"},{"$error":"#N/A"},null,null,{"$error":"#N/A"},{"$error":"#N/A"},null,0,{"$error":"#N/A"},{"$error":"#N/A"},{"$error":"#N/A"},{"$f":"IF(B62>0,re(B$10,E62,F62,B$6,B$14,B$13), )","v":0},null,null,{"$error":"#N/A"},{"$error":"#N/A"},{"$error":"#N/A"},0]
[null,null,null,null,{"$error":"#N/A"},{"$error":"#N/A"},null,null,{"$error":"#N/A"},{"$error":"#N/A"},null,0,{"$error":"#N/A"},{"$error":"#N/A"},{"$error":"#N/A"},{"$f":"IF(B63>0,re(B$10,E63,F63,B$6,B$14,B$13), )","v":0},null,null,{"$error":"#N/A"},{"$error":"#N/A"},{"$error":"#N/A"},0]
[null,null,null,null,{"$error":"#N/A"},{"$error":"#N/A"},null,null,{"$error":"#N/A"},{"$error":"#N/A"},null,0,{"$error":"#N/A"},{"$error":"#N/A"},{"$error":"#N/A"},{"$f":"IF(B64>0,re(B$10,E64,F64,B$6,B$14,B$13), )","v":0},null,null,{"$error":"#N/A"},{"$error":"#N/A"},{"$error":"#N/A"},0]
[null,null,null,null,{"$error":"#N/A"},{"$error":"#N/A"},null,null,{"$error":"#N/A"},{"$error":"#N/A"},null,0,{"$error":"#N/A"},{"$error":"#N/A"},{"$error":"#N/A"},{"$f":"IF(B65>0,re(B$10,E65,F65,B$6,B$14,B$13), )","v":0},null,null,{"$error":"#N/A"},{"$error":"#N/A"},{"$error":"#N/A"},0]
[null,null,null,null,{"$error":"#N/A"},{"$error":"#N/A"},null,null,{"$error":"#N/A"},{"$error":"#N/A"},null,0,{"$error":"#N/A"},{"$error":"#N/A"},{"$error":"#N/A"},{"$f":"IF(B66>0,re(B$10,E66,F66,B$6,B$14,B$13), )","v":0},null,null,{"$error":"#N/A"},{"$error":"#N/A"},{"$error":"#N/A"},0]
[null,null,null,null,{"$error":"#N/A"},{"$error":"#N/A"},null,null,{"$error":"#N/A"},{"$error":"#N/A"},null,0,{"$error":"#N/A"},{"$error":"#N/A"},{"$error":"#N/A"},{"$f":"IF(B67>0,re(B$10,E67,F67,B$6,B$14,B$13), )","v":0},null,null,{"$error":"#N/A"},{"$error":"#N/A"},{"$error":"#N/A"},0]
[null,null,null,null,{"$error":"#N/A"},{"$error":"#N/A"},null,null,{"$error":"#N/A"},{"$error":"#N/A"},null,0,{"$error":"#N/A"},{"$error":"#N/A"},{"$error":"#N/A"},{"$f":"IF(B68>0,re(B$10,E68,F68,B$6,B$14,B$13), )","v":0},null,null,{"$error":"#N/A"},{"$error":"#N/A"},{"$error":"#N/A"},0]
[null,null,null,null,{"$error":"#N/A"},{"$error":"#N/A"},null,null,{"$error":"#N/A"},{"$error":"#N/A"},null,0,{"$error":"#N/A"},{"$error":"#N/A"},{"$error":"#N/A"},{"$f":"IF(B69>0,re(B$10,E69,F69,B$6,B$14,B$13), )","v":0},null,null,{"$error":"#N/A"},{"$error":"#N/A"},{"$error":"#N/A"},0]
[null,null,null,null,{"$error":"#N/A"},{"$error":"#N/A"},null,null,{"$error":"#N/A"},{"$error":"#N/A"},null,0,{"$error":"#N/A"},{"$error":"#N/A"},{"$error":"#N/A"},{"$f":"IF(B70>0,re(B$10,E70,F70,B$6,B$14,B$13), )","v":0},null,null,{"$error":"#N/A"},{"$error":"#N/A"},{"$error":"#N/A"},0]
[null,null,null,null,{"$error":"#N/A"},{"$error":"#N/A"},null,null,{"$error":"#N/A"},{"$error":"#N/A"},null,0,{"$error":"#N/A"},{"$error":"#N/A"},{"$error":"#N/A"},{"$f":"IF(B71>0,re(B$10,E71,F71,B$6,B$14,B$13), )","v":0},null,null,{"$error":"#N/A"},{"$error":"#N/A"},{"$error":"#N/A"},0]
[null,null,null,null,{"$error":"#N/A"},{"$error":"#N/A"},null,null,{"$error":"#N/A"},{"$error":"#N/A"},null,0,{"$error":"#N/A"},{"$error":"#N/A"},{"$error":"#N/A"},{"$f":"IF(B72>0,re(B$10,E72,F72,B$6,B$14,B$13), )","v":0},null,null,{"$error":"#N/A"},{"$error":"#N/A"},{"$error":"#N/A"},0]
[null,null,null,null,{"$error":"#N/A"},{"$error":"#N/A"},null,null,{"$error":"#N/A"},{"$error":"#N/A"},null,0,{"$error":"#N/A"},{"$error":"#N/A"},{"$error":"#N/A"},{"$f":"IF(B73>0,re(B$10,E73,F73,B$6,B$14,B$13), )","v":0},null,null,{"$error":"#N/A"},{"$error":"#N/A"},{"$error":"#N/A"},0]
[null,null,null,null,{"$error":"#N/A"},{"$error":"#N/A"},null,null,{"$error":"#N/A"},{"$error":"#N/A"},null,0,{"$error":"#N/A"},{"$error":"#N/A"},{"$error":"#N/A"},{"$f":"IF(B74>0,re(B$10,E74,F74,B$6,B$14,B$13), )","v":0},null,null,{"$error":"#N/A"},{"$error":"#N/A"},{"$error":"#N/A"},0]
[null,null,null,null,{"$error":"#N/A"},{"$error":"#N/A"},null,null,{"$error":"#N/A"},{"$error":"#N/A"},null,0,{"$error":"#N/A"},{"$error":"#N/A"},{"$error":"#N/A"},{"$f":"IF(B75>0,re(B$10,E75,F75,B$6,B$14,B$13), )","v":0},null,null,{"$error":"#N/A"},{"$error":"#N/A"},{"$error":"#N/A"},0]
[null,null,null,null,{"$error":"#N/A"},{"$error":"#N/A"},null,null,{"$error":"#N/A"},{"$error":"#N/A"},null,0,{"$error":"#N/A"},{"$error":"#N/A"},{"$error":"#N/A"},{"$f":"IF(B76>0,re(B$10,E76,F76,B$6,B$14,B$13), )","v":0},null,null,{"$error":"#N/A"},{"$error":"#N/A"},{"$error":"#N/A"},0]
[null,null,null,null,{"$error":"#N/A"},{"$error":"#N/A"},null,null,{"$error":"#N/A"},{"$error":"#N/A"},null,0,{"$error":"#N/A"},{"$error":"#N/A"},{"$error":"#N/A"},{"$f":"IF(B77>0,re(B$10,E77,F77,B$6,B$14,B$13), )","v":0},null,null,{"$error":"#N/A"},{"$error":"#N/A"},{"$error":"#N/A"},0]
[null,null,null,null,{"$error":"#N/A"},{"$error":"#N/A"},null,null,{"$error":"#N/A"},{"$error":"#N/A"},null,0,{"$error":"#N/A"},{"$error":"#N/A"},{"$error":"#N/A"},{"$f":"IF(B78>0,re(B$10,E78,F78,B$6,B$14,B$13), )","v":0},null,null,{"$error":"#N/A"},{"$error":"#N/A"},{"$error":"#N/A"},0]
[null,null,null,null,{"$error":"#N/A"},{"$error":"#N/A"},null,null,{"$error":"#N/A"},{"$error":"#N/A"},null,0,{"$error":"#N/A"},{"$error":"#N/A"},{"$error":"#N/A"},{"$f":"IF(B79>0,re(B$10,E79,F79,B$6,B$14,B$13), )","v":0},null,null,{"$error":"#N/A"},{"$error":"#N/A"},{"$error":"#N/A"},0]
[null,null,null,null,{"$error":"#N/A"},{"$error":"#N/A"},null,null,{"$error":"#N/A"},{"$error":"#N/A"},null,0,{"$error":"#N/A"},{"$error":"#N/A"},{"$error":"#N/A"},{"$f":"IF(B80>0,re(B$10,E80,F80,B$6,B$14,B$13), )","v":0},null,null,{"$error":"#N/A"},{"$error":"#N/A"},{"$error":"#N/A"},0]
[null,null,null,null,{"$error":"#N/A"},{"$error":"#N/A"},null,null,{"$error":"#N/A"},{"$error":"#N/A"},null,0,{"$error":"#N/A"},{"$error":"#N/A"},{"$error":"#N/A"},{"$f":"IF(B81>0,re(B$10,E81,F81,B$6,B$14,B$13), )","v":0},null,null,{"$error":"#N/A"},{"$error":"#N/A"},{"$error":"#N/A"},0]
[]
[null,null,null,null,null,null,null,null,null,null,null,null,null,null,null,{"$f":"AVERAGE(P24:P81)","v":6.838876711443885E-2}]

{"sheet":"Figures","index":2,"n_rows":88,"n_cols":22,"rows_kept":88,"cut":false,"hidden":false,"merged":[]}
[]
[null,null,null,"Figure 1",null,null,null,null,null,null,null,"Figure 2"]
[null,null,null,null,null,null,null,null,null,null,null,null,null,null,null,null,null,null,null,{"$f":"0.8*MIN(Data!B23:B81)","v":0.8},{"$f":"Data!E21","v":59.57}]
[null,null,null,null,null,null,null,null,null,null,null,null,null,null,null,null,null,null,null,{"$f":"MAX(Data!B23:B81)","v":54410},{"$f":"U3","v":59.57}]
[null,null,null,null,null,null,null,null,null,null,null,null,null,null,null,null,null,null,null,{"$f":"T3","v":0.8},{"$f":"Data!F21","v":71.38}]
[null,null,null,null,null,null,null,null,null,null,null,null,null,null,null,null,null,null,null,{"$f":"T4","v":54410},{"$f":"U5","v":71.38}]
[]
[null,null,null,null,null,null,null,null,null,null,null,null,null,null,null,null,null,null,null,{"$f":"T4/4","v":13602.5},{"$f":"IF(V8<V9,V8,NA())","v":58.57},{"$f":"IF(Data!B10>Data!E21,Data!B10,Data!E21-1)","v":58.57}]
[null,null,null,null,null,null,null,null,null,null,null,null,null,null,null,null,null,null,null,{"$f":"T8","v":13602.5},{"$f":"IF(V8<V9,V9,NA())","v":72.38},{"$f":"IF(Data!B11<Data!F21,Data!B11,Data!F21+1)","v":72.38}]
[]
[]
[]
[]
[]
[]
[]
[]
[]
[]
[]
[null,null,null,"Figure 3",null,null,null,null,null,null,null,"Figure 4"]
[null,"Qn (ft3/d)","sn (ft)",null,null,null,null,null,null,null,null,null,null,null,null,null,null,null,null,"bn","sn"]
[null,0,0,null,null,null,null,null,null,null,null,null,null,null,null,null,null,null,null,0.52,1.45]
[null,4,0.38,null,null,null,null,null,null,null,null,null,null,null,null,null,null,null,null,0.05,2.0499999999999998]
[]
[]
[null,"Drawdown Adjust.",null,null,null,null,null,null,null,null,null,null,null,null,null,null,null,null,null,"J-ratio",{"$f":"(U23-U24)/(T23-T24)","v":-1.2765957446808507}]
[null,"Dsn (ft)",0]
[]
[]
[]
[]
[]
[]
[]
[]
[]
[]
[]
[]
[null,null,null,"Figure 5",null,null,null,null,null,null,null,"Figure 6"]
[]
[]
[]
[]
[]
[]
[]
[]
[]
[]
[]
[]
[]
[]
[]
[]
[]
[]
[null,null,null,"Figure 7",null,null,null,null,null,null,null,"Figure 8"]
[]
[]
[]
[]
[]
[]
[]
[]
[]
[]
[]
[]
[]
[]
[]
[]
[]
[]
[null,null,null,"Figure 9",null,null,null,null,null,null,null,"Figure 10"]
[]
[]
[]
[]
[]
[]
[null,null,null,null,null,null,null,null,null,null,null,null,null,null,null,null,null,null,null,"t (min)","sn (ft)"]
[null,null,null,null,null,null,null,null,null,null,null,null,null,null,null,null,null,null,null,12,0.115]
[null,null,null,null,null,null,null,null,null,null,null,null,null,null,null,null,null,null,null,12,0]

{"sheet":"B&R","index":3,"n_rows":64,"n_cols":28,"rows_kept":64,"cut":false,"hidden":false,"merged":[]}
["Generalized Bouwer and Rice (1976)"]
["Well Designation:",null,{"$f":"IF(Data!B1 > 0,Data!B1,\"\")","v":"YYY"}]
["Date:",null,{"$f":"IF(Data!B2 > 0,Data!B2,\"\")","v":"date"},null,null,null,null,null,null,null,null,null,null,null,null,null,null,null,null,null,"y = A + B x"]
[null,null,null,null,null,null,null,null,null,null,null,null,null,null,null,null,null,null,null,null,null,null,null,"B&R Type Curve"]
[null,null,null,null,null,null,null,null,null,null,null,null,"Xi","Yi","X2","XY","(y-A-Bx)2","e","count","s/s0","SX",{"$f":"SUM(M6:M64)","v":96521},null,"t (min)","s/s0",null,"Xi","Yi"]
[null,null,null,null,null,null,null,null,null,null,null,null,{"$f":"IF(Data!B23>=D$9,Data!B23-D$9,0)","v":0},{"$f":"IF(S6>0,LN(Data!J23),0)","v":0},{"$f":"M6^2","v":0},{"$f":"M6*N6","v":0},{"$f":"IF(M6>0,(N6-V$11-V$12*M6)^2,0)","v":0},{"$f":"IF(M6>0,(N6-V$11-V$12*M6)/SQRT(V$14),0)","v":0},{"$f":"IF(Data!B23>'B&R'!D$9,1,0)","v":0},{"$f":"IF(S6=0,NA(),EXP(N6)/EXP(V$19))","v":{"$error":"#N/A"}},"SY",{"$f":"SUM(N6:N64)","v":5.287110037958997},null,0,{"$f":"EXP(-2*E$12*(X6/1440)*(-J$15)/(Data!V$23^2*LN('B&R'!J$12)))","v":1},null,{"$f":"IF(S6>0,M6,NA())","v":{"$error":"#N/A"}},{"$f":"IF(T6>0,N6,NA())","v":{"$error":"#N/A"}}]
[null,"Enter early time cut-off for least-squares model fit",null,null,null,null,null,null,null,"Le/re",null,null,{"$f":"IF(Data!B24>=D$9,Data!B24-D$9,0)","v":0},{"$f":"IF(S7>0,LN(Data!J24),0)","v":0},{"$f":"M7^2","v":0},{"$f":"M7*N7","v":0},{"$f":"IF(M7>0,(N7-V$11-V$12*M7)^2,0)","v":0},{"$f":"IF(M7>0,(N7-V$11-V$12*M7)/SQRT(V$14),0)","v":0},{"$f":"IF(Data!B24>'B&R'!D$9,1,0)","v":0},{"$f":"IF(S7=0,NA(),EXP(N7)/EXP(V$19))","v":{"$error":"#N/A"}},"SX2",{"$f":"SUM(O6:O64)","v":3861463951},null,{"$f":"X6+1.05*(MAX(M$6:M$64)/30)","v":1903.4749999999999},{"$f":"EXP(-2*E$12*(X7/1440)*(-J$15)/(Data!V$23^2*LN('B&R'!J$12)))","v":0.99908856219221021},null,{"$f":"IF(S7>0,M7,NA())","v":{"$error":"#N/A"}},{"$f":"IF(T7>0,N7,NA())","v":{"$error":"#N/A"}}]
[null,null,null,null,null,null,null,null,null,{"$f":"IF(Data!E21<Data!B10,(Data!F21-Data!B10)/Data!B13,(Data!F21-Data!E21)/Data!B13)","v":74.434990659519499},null,null,{"$f":"IF(Data!B25>=D$9,Data!B25-D$9,0)","v":0},{"$f":"IF(S8>0,LN(Data!J25),0)","v":0},0,0,0,0,{"$f":"IF(Data!B25>'B&R'!D$9,1,0)","v":0},{"$error":"#N/A"},"SXY",{"$f":"SUM(P6:P64)","v":32468.851259076037},null,{"$f":"X7+1.05*(MAX(M$6:M$64)/30)","v":3806.95},{"$f":"EXP(-2*E$12*(X8/1440)*(-J$15)/(Data!V$23^2*LN('B&R'!J$12)))","v":0.99817795510329788},null,{"$error":"#N/A"},{"$error":"#N/A"}]
[null,null,"Timecut",25,"<-  Enter or change value here",null,null,null,null,"C",null,null,{"$f":"IF(Data!B26>=D$9,Data!B26-D$9,0)","v":0},{"$f":"IF(S9>0,LN(Data!J26),0)","v":0},0,0,0,0,{"$f":"IF(Data!B26>'B&R'!D$9,1,0)","v":0},{"$error":"#N/A"},"N",{"$f":"SUM(S6:S64)","v":15},null,5710.4249999999993,{"$f":"EXP(-2*E$12*(X9/1440)*(-J$15)/(Data!V$23^2*LN('B&R'!J$12)))","v":0.99726817797611456},null,{"$error":"#N/A"},{"$error":"#N/A"}]
[null,null,null,null,null,null,null,null,null,{"$f":"IF(J8<2000,0.792+0.03993*J8-0.00005743*J8^2+0.00000003858*J8^3-0.000000000009659*J8^4,13.5)","v":3.4616087147591461},null,null,{"$f":"IF(Data!B27>=D$9,Data!B27-D$9,0)","v":0},{"$f":"IF(S10>0,LN(Data!J27),0)","v":0},0,0,0,0,{"$f":"IF(Data!B27>'B&R'!D$9,1,0)","v":0},{"$error":"#N/A"},"D",{"$f":"V9*V7-V5^2","v":48605655824},null,7613.9,{"$f":"EXP(-2*E$12*(X10/1440)*(-J$15)/(Data!V$23^2*LN('B&R'!J$12)))","v":0.99635923005420146},null,{"$error":"#N/A"},{"$error":"#N/A"}]
[null,null,null,null,null,null,null,null,null,"R/re",null,null,{"$f":"IF(Data!B28>=D$9,Data!B28-D$9,0)","v":0},{"$f":"IF(S11>0,LN(Data!J28),0)","v":0},0,0,0,0,{"$f":"IF(Data!B28>'B&R'!D$9,1,0)","v":0},{"$error":"#N/A"},"A",{"$f":"(V7*V6-V5*V8)/V10","v":0.35555654030776956},null,9517.375,{"$f":"EXP(-2*E$12*(X11/1440)*(-J$15)/(Data!V$23^2*LN('B&R'!J$12)))","v":0.9954511105817897},null,{"$error":"#N/A"},{"$error":"#N/A"}]
[null,"Model Results:",null,"Tn (ft2/d) =",{"$f":"1440*V22*(-V12)","v":2.2541566872298224E-5},"+/-",{"$f":"1440*V22*SQRT(V15)","v":3.9103083314596522E-5},"ft2/d",null,{"$f":"EXP(((1.1/LN(J8))+J10/J8)^-1)","v":27.50099578256204},null,null,{"$f":"IF(Data!B29>=D$9,Data!B29-D$9,0)","v":0},{"$f":"IF(S12>0,LN(Data!J29),0)","v":0},0,0,0,0,{"$f":"IF(Data!B29>'B&R'!D$9,1,0)","v":0},{"$error":"#N/A"},"B",{"$f":"(V9*V8-V5*V6)/V10","v":-4.7904670131418516E-7},null,11420.85,{"$f":"EXP(-2*E$12*(X12/1440)*(-J$15)/(Data!V$23^2*LN('B&R'!J$12)))","v":0.99454381880379916},null,{"$error":"#N/A"},{"$error":"#N/A"}]
[null,null,null,null,null,null,null,null,null,null,null,null,{"$f":"IF(Data!B30>=D$9,Data!B30-D$9,0)","v":0},{"$f":"IF(S13>0,LN(Data!J30),0)","v":0},0,0,0,0,{"$f":"IF(Data!B30>'B&R'!D$9,1,0)","v":0},{"$error":"#N/A"},null,null,null,13324.325000000001,{"$f":"EXP(-2*E$12*(X13/1440)*(-J$15)/(Data!V$23^2*LN('B&R'!J$12)))","v":0.99363735396583774},null,{"$error":"#N/A"},{"$error":"#N/A"}]
[null,null,null,null,null,null,null,null,null,"J-Ratio",null,null,{"$f":"IF(Data!B31>=D$9,Data!B31-D$9,0)","v":0},{"$f":"IF(S14>0,LN(Data!J31),0)","v":0},0,0,0,0,{"$f":"IF(Data!B31>'B&R'!D$9,1,0)","v":0},{"$error":"#N/A"},"sy2",{"$f":"SUM(Q6:Q64)/(V9-2)","v":2.2377164853515145E-3},null,15227.800000000001,{"$f":"EXP(-2*E$12*(X14/1440)*(-J$15)/(Data!V$23^2*LN('B&R'!J$12)))","v":0.99273171531420112},null,{"$error":"#N/A"},{"$error":"#N/A"}]
[null,null,null,null,null,null,null,null,null,{"$f":"Figures!U27","v":-1.2765957446808507},null,null,{"$f":"IF(Data!B32>=D$9,Data!B32-D$9,0)","v":0},{"$f":"IF(S15>0,LN(Data!J32),0)","v":0},0,0,0,0,{"$f":"IF(Data!B32>'B&R'!D$9,1,0)","v":0},{"$error":"#N/A"},"sB2",{"$f":"V9*V14/V10","v":6.9057287081597132E-13},null,17131.275000000001,{"$f":"EXP(-2*E$12*(X15/1440)*(-J$15)/(Data!V$23^2*LN('B&R'!J$12)))","v":0.99182690209587177},null,{"$error":"#N/A"},{"$error":"#N/A"}]
[null,null,null,null,null,null,null,null,null,null,null,null,{"$f":"IF(Data!B33>=D$9,Data!B33-D$9,0)","v":0},{"$f":"IF(S16>0,LN(Data!J33),0)","v":0},0,0,0,0,{"$f":"IF(Data!B33>'B&R'!D$9,1,0)","v":0},{"$error":"#N/A"},null,null,null,19034.75,{"$f":"EXP(-2*E$12*(X16/1440)*(-J$15)/(Data!V$23^2*LN('B&R'!J$12)))","v":0.99092291355851858},null,{"$error":"#N/A"},{"$error":"#N/A"}]
[null,null,null,null,null,null,null,null,null,null,null,null,{"$f":"IF(Data!B34>=D$9,Data!B34-D$9,0)","v":1},{"$f":"IF(S17>0,LN(Data!J34),0)","v":0.42526773540434482},1,0.42526773540434482,4.8597175118583755E-3,1.4736792953240392,{"$f":"IF(Data!B34>'B&R'!D$9,1,0)","v":1},1.0721984803562286,null,null,null,20938.224999999999,{"$f":"EXP(-2*E$12*(X17/1440)*(-J$15)/(Data!V$23^2*LN('B&R'!J$12)))","v":0.99001974895049616},null,1,0.42526773540434482]
[null,null,null,null,null,null,null,null,null,null,null,null,{"$f":"IF(Data!B35>=D$9,Data!B35-D$9,0)","v":5},{"$f":"IF(S18>0,LN(Data!J35),0)","v":0.41871033485818709},25,2.0935516742909357,3.9887043080230394E-3,1.335098753543577,{"$f":"IF(Data!B35>'B&R'!D$9,1,0)","v":1},1.0651906471512873,"Plot Model Line",null,null,22841.699999999997,{"$f":"EXP(-2*E$12*(X18/1440)*(-J$15)/(Data!V$23^2*LN('B&R'!J$12)))","v":0.98911740752084421},null,5,0.41871033485818709]
[null,null,null,null,null,null,null,null,null,null,null,null,{"$f":"IF(Data!B36>=D$9,Data!B36-D$9,0)","v":15},{"$f":"IF(S19>0,LN(Data!J36),0)","v":0.39204208777602156},225,5.8806313166403239,1.331719574127171E-3,0.77144303248368373,{"$f":"IF(Data!B36>'B&R'!D$9,1,0)","v":1},1.0371593143315123,0,{"$f":"V11","v":0.35555654030776956},null,24745.174999999996,{"$f":"EXP(-2*E$12*(X19/1440)*(-J$15)/(Data!V$23^2*LN('B&R'!J$12)))","v":0.98821588851928666},null,15,0.39204208777602156]
[null,null,null,null,null,null,null,null,null,"Coef. Of",null,null,{"$f":"IF(Data!B37>=D$9,Data!B37-D$9,0)","v":25},{"$f":"IF(S20>0,LN(Data!J37),0)","v":0.37156355643248501},625,9.2890889108121257,2.5660811405911048E-4,0.33863563833688942,{"$f":"IF(Data!B37>'B&R'!D$9,1,0)","v":1},1.0161358147166886,{"$f":"MAX(M6:M64)","v":54385},{"$f":"V11+V12*U20","v":0.32950358545679759},null,26648.649999999994,{"$f":"EXP(-2*E$12*(X20/1440)*(-J$15)/(Data!V$23^2*LN('B&R'!J$12)))","v":0.98731519119623157},null,25,0.37156355643248501]
[null,null,null,null,null,null,null,null,null,"Variation",null,null,{"$f":"IF(Data!B38>=D$9,Data!B38-D$9,0)","v":35},{"$f":"IF(S21>0,LN(Data!J38),0)","v":0.35065687161317055},1225,12.272990506460969,2.3842732528069998E-5,-0.103222763696735,{"$f":"IF(Data!B38>'B&R'!D$9,1,0)","v":1},0.99511231510185971,null,null,null,28552.124999999993,{"$f":"EXP(-2*E$12*(X21/1440)*(-J$15)/(Data!V$23^2*LN('B&R'!J$12)))","v":0.98641531480277023},null,35,0.35065687161317055]
[null,null,null,null,null,null,null,null,null,{"$f":"G12/E12","v":1.7347100818732824},null,null,{"$f":"IF(Data!B39>=D$9,Data!B39-D$9,0)","v":45},{"$f":"IF(S22>0,LN(Data!J39),0)","v":0.3364722366212119},2025,15.141250647954536,3.6338830736387315E-4,-0.40297949087528506,{"$f":"IF(Data!B39>'B&R'!D$9,1,0)","v":1},0.98109664869197222,"factor",{"$f":"Data!V23^2*LN('B&R'!J12)/(2*(-Figures!U27))","v":3.2677118620369684E-2},null,30455.599999999991,{"$f":"EXP(-2*E$12*(X22/1440)*(-J$15)/(Data!V$23^2*LN('B&R'!J$12)))","v":0.98551625859067604},null,45,0.3364722366212119]
[null,null,null,null,null,null,null,null,null,null,null,null,{"$f":"IF(Data!B40>=D$9,Data!B40-D$9,0)","v":55},{"$f":"IF(S23>0,LN(Data!J40),0)","v":0.32208349916911516},3025,17.714592454301332,1.1186813107709726E-3,-0.70705086941354856,{"$f":"IF(Data!B40>'B&R'!D$9,1,0)","v":1},0.96708098228208972,null,null,null,32359.07499999999,{"$f":"EXP(-2*E$12*(X23/1440)*(-J$15)/(Data!V$23^2*LN('B&R'!J$12)))","v":0.98461802181240499},null,55,0.32208349916911516]
[null,null,null,null,null,null,null,null,null,null,null,null,{"$f":"IF(Data!B41>=D$9,Data!B41-D$9,0)","v":65},{"$f":"IF(S24>0,LN(Data!J41),0)","v":0.31481073984003166},4225,20.462698089602057,1.6576837369641285E-3,-0.86069307300027598,{"$f":"IF(Data!B41>'B&R'!D$9,1,0)","v":1},0.96007314907714336,null,null,null,34262.549999999988,{"$f":"EXP(-2*E$12*(X24/1440)*(-J$15)/(Data!V$23^2*LN('B&R'!J$12)))","v":0.98372060372109404},null,65,0.31481073984003166]
[null,null,null,null,null,null,null,null,null,null,null,null,{"$f":"IF(Data!B42>=D$9,Data!B42-D$9,0)","v":75},{"$f":"IF(S25>0,LN(Data!J42),0)","v":0.30748469974796022},5625,23.061352481097018,2.307448847168088E-3,-1.0154616124298785,{"$f":"IF(Data!B42>'B&R'!D$9,1,0)","v":1},0.95306531587220211,"s0 (ft)",{"$f":"EXP(V19)","v":1.4269746022132692},null,36166.024999999987,{"$f":"EXP(-2*E$12*(X25/1440)*(-J$15)/(Data!V$23^2*LN('B&R'!J$12)))","v":0.98282400357056088},null,75,0.30748469974796022]
[null,null,null,null,null,null,null,null,null,null,null,null,{"$f":"IF(Data!B43>=D$9,Data!B43-D$9,0)","v":975},{"$f":"IF(S26>0,LN(Data!J43),0)","v":0.31481073984003166},950625,306.94047134403087,1.6223760850926092E-3,-0.85147761942459743,{"$f":"IF(Data!B43>'B&R'!D$9,1,0)","v":1},0.96007314907714336,null," ",null,38069.499999999985,{"$f":"EXP(-2*E$12*(X26/1440)*(-J$15)/(Data!V$23^2*LN('B&R'!J$12)))","v":0.98192822061530338},null,975,0.31481073984003166]
[null,null,null,null,null,null,null,null,null,null,null,null,{"$f":"IF(Data!B44>=D$9,Data!B44-D$9,0)","v":2425},{"$f":"IF(S27>0,LN(Data!J44),0)","v":0.39204208777602156},5880625,950.70206285685231,1.4173143572773486E-3,0.79584879415114007,{"$f":"IF(Data!B44>'B&R'!D$9,1,0)","v":1},1.0371593143315123,null,null,null,39972.974999999984,{"$f":"EXP(-2*E$12*(X27/1440)*(-J$15)/(Data!V$23^2*LN('B&R'!J$12)))","v":0.9810332541104988},null,2425,0.39204208777602156]
[null,null,null,null,null,null,null,null,null,null,null,null,{"$f":"IF(Data!B45>=D$9,Data!B45-D$9,0)","v":3875},{"$f":"IF(S28>0,LN(Data!J45),0)","v":0.40546510810816438},15015625,1571.1772939191369,2.6796021562156586E-3,1.094290499180369,{"$f":"IF(Data!B45>'B&R'!D$9,1,0)","v":1},1.0511749807413999,null,null,null,41876.449999999983,{"$f":"EXP(-2*E$12*(X28/1440)*(-J$15)/(Data!V$23^2*LN('B&R'!J$12)))","v":0.98013910331200349},null,3875,0.40546510810816438]
[null,null,null,null,null,null,null,null,null,null,null,null,{"$f":"IF(Data!B46>=D$9,Data!B46-D$9,0)","v":5325},{"$f":"IF(S29>0,LN(Data!J46),0)","v":0.27002713721306193},28355625,1437.8945056595549,6.8854280452305778E-3,-1.7541347065194786,{"$f":"IF(Data!B46>'B&R'!D$9,1,0)","v":1},0.91802614984749076,null,null,null,43779.924999999981,{"$f":"EXP(-2*E$12*(X29/1440)*(-J$15)/(Data!V$23^2*LN('B&R'!J$12)))","v":0.97924576747635173},null,5325,0.27002713721306193]
[null,null,null,null,null,null,null,null,null,null,null,null,{"$f":"IF(Data!B47>=D$9,Data!B47-D$9,0)","v":29215},{"$f":"IF(S30>0,LN(Data!J47),0)","v":0.32208349916911516},853516225,9409.6694282256994,3.7938047628824139E-4,-0.41175128010938827,{"$f":"IF(Data!B47>'B&R'!D$9,1,0)","v":1},0.96708098228208972,null,null,null,45683.39999999998,{"$f":"EXP(-2*E$12*(X30/1440)*(-J$15)/(Data!V$23^2*LN('B&R'!J$12)))","v":0.97835324586075567},null,29215,0.32208349916911516]
[null,null,null,null,null,null,null,null,null,null,null,null,{"$f":"IF(Data!B48>=D$9,Data!B48-D$9,0)","v":54385},{"$f":"IF(S31>0,LN(Data!J48),0)","v":0.34358970439007447},2957728225,18686.1260732542,1.9841874660242093E-4,0.29777540244949241,{"$f":"IF(Data!B48>'B&R'!D$9,1,0)","v":1},0.98810448189691347,null,null,null,47586.874999999978,{"$f":"EXP(-2*E$12*(X31/1440)*(-J$15)/(Data!V$23^2*LN('B&R'!J$12)))","v":0.9774615377231044},null,54385,0.34358970439007447]
[null,null,null,null,null,null,null,null,null,null,null,null,{"$f":"IF(Data!B49>=D$9,Data!B49-D$9,0)","v":0},{"$f":"IF(S32>0,LN(Data!J49),0)","v":0},0,0,0,0,{"$f":"IF(Data!B49>'B&R'!D$9,1,0)","v":0},{"$error":"#N/A"},null,null,null,49490.349999999977,{"$f":"EXP(-2*E$12*(X32/1440)*(-J$15)/(Data!V$23^2*LN('B&R'!J$12)))","v":0.97657064232196322},null,{"$error":"#N/A"},{"$error":"#N/A"}]
[null,null,null,null,null,null,null,null,null,null,null,null,{"$f":"IF(Data!B50>=D$9,Data!B50-D$9,0)","v":0},{"$f":"IF(S33>0,LN(Data!J50),0)","v":0},0,0,0,0,{"$f":"IF(Data!B50>'B&R'!D$9,1,0)","v":0},{"$error":"#N/A"},null,null,null,51393.824999999975,{"$f":"EXP(-2*E$12*(X33/1440)*(-J$15)/(Data!V$23^2*LN('B&R'!J$12)))","v":0.97568055891657346},null,{"$error":"#N/A"},{"$error":"#N/A"}]
[null,null,null,null,null,null,null,null,null,null,null,null,{"$f":"IF(Data!B51>=D$9,Data!B51-D$9,0)","v":0},{"$f":"IF(S34>0,LN(Data!J51),0)","v":0},0,0,0,0,{"$f":"IF(Data!B51>'B&R'!D$9,1,0)","v":0},{"$error":"#N/A"},null,null,null,53297.299999999974,{"$f":"EXP(-2*E$12*(X34/1440)*(-J$15)/(Data!V$23^2*LN('B&R'!J$12)))","v":0.97479128676685145},null,{"$error":"#N/A"},{"$error":"#N/A"}]
[null,"C coefficient calculated from Eq. 6.5(c) of Butler, The Design, Performance, and",null,null,null,null,null,null,null,null,null,null,{"$f":"IF(Data!B52>=D$9,Data!B52-D$9,0)","v":0},{"$f":"IF(S35>0,LN(Data!J52),0)","v":0},0,0,0,0,{"$f":"IF(Data!B52>'B&R'!D$9,1,0)","v":0},{"$error":"#N/A"},null,null,null,55200.774999999972,{"$f":"EXP(-2*E$12*(X35/1440)*(-J$15)/(Data!V$23^2*LN('B&R'!J$12)))","v":0.97390282513338799},null,{"$error":"#N/A"},{"$error":"#N/A"}]
[null,"Analysis of Slug Tests, CRC Press, 2000.",null,null,null,null,null,null,null,null,null,null,{"$f":"IF(Data!B53>=D$9,Data!B53-D$9,0)","v":0},{"$f":"IF(S36>0,LN(Data!J53),0)","v":0},0,0,0,0,{"$f":"IF(Data!B53>'B&R'!D$9,1,0)","v":0},{"$error":"#N/A"},null,null,null,57104.249999999971,{"$f":"EXP(-2*E$12*(X36/1440)*(-J$15)/(Data!V$23^2*LN('B&R'!J$12)))","v":0.97301517327744824},null,{"$error":"#N/A"},{"$error":"#N/A"}]
[null,null,null,null,null,null,null,null,null,null,null,null,{"$f":"IF(Data!B54>=D$9,Data!B54-D$9,0)","v":0},{"$f":"IF(S37>0,LN(Data!J54),0)","v":0},0,0,0,0,{"$f":"IF(Data!B54>'B&R'!D$9,1,0)","v":0},{"$error":"#N/A"},null,null,null,null,null,null,{"$error":"#N/A"},{"$error":"#N/A"}]
[null,null,null,null,null,null,null,null,null,null,null,null,{"$f":"IF(Data!B55>=D$9,Data!B55-D$9,0)","v":0},{"$f":"IF(S38>0,LN(Data!J55),0)","v":0},0,0,0,0,{"$f":"IF(Data!B55>'B&R'!D$9,1,0)","v":0},{"$error":"#N/A"},null,null,null,null,null,null,{"$error":"#N/A"},{"$error":"#N/A"}]
[null,null,null,null,null,null,null,null,null,null,null,null,{"$f":"IF(Data!B56>=D$9,Data!B56-D$9,0)","v":0},{"$f":"IF(S39>0,LN(Data!J56),0)","v":0},0,0,0,0,{"$f":"IF(Data!B56>'B&R'!D$9,1,0)","v":0},{"$error":"#N/A"},null,null,null,{"$f":"TRUNC(100*E12)/100","v":0},null,null,{"$error":"#N/A"},{"$error":"#N/A"}]
[null,null,null,null,null,null,null,null,null,null,null,null,{"$f":"IF(Data!B57>=D$9,Data!B57-D$9,0)","v":0},{"$f":"IF(S40>0,LN(Data!J57),0)","v":0},0,0,0,0,{"$f":"IF(Data!B57>'B&R'!D$9,1,0)","v":0},{"$error":"#N/A"},null,null,null,{"$f":"X39","v":0},null,null,{"$error":"#N/A"},{"$error":"#N/A"}]
[null,null,null,null,null,null,null,null,null,null,null,null,{"$f":"IF(Data!B58>=D$9,Data!B58-D$9,0)","v":0},{"$f":"IF(S41>0,LN(Data!J58),0)","v":0},0,0,0,0,{"$f":"IF(Data!B58>'B&R'!D$9,1,0)","v":0},{"$error":"#N/A"},null,null,null,{"$f":"CONCATENATE(\" T = \",X40,\" ft2/d\")","v":" T = 0 ft2/d"},null,null,{"$error":"#N/A"},{"$error":"#N/A"}]
[null,null,null,null,null,null,null,null,null,null,null,null,{"$f":"IF(Data!B59>=D$9,Data!B59-D$9,0)","v":0},{"$f":"IF(S42>0,LN(Data!J59),0)","v":0},0,0,0,0,{"$f":"IF(Data!B59>'B&R'!D$9,1,0)","v":0},{"$error":"#N/A"},null,null,null,null,null,null,{"$error":"#N/A"},{"$error":"#N/A"}]
[null,null,null,null,null,null,null,null,null,null,null,null,{"$f":"IF(Data!B60>=D$9,Data!B60-D$9,0)","v":0},{"$f":"IF(S43>0,LN(Data!J60),0)","v":0},0,0,0,0,{"$f":"IF(Data!B60>'B&R'!D$9,1,0)","v":0},{"$error":"#N/A"},null,null,null,null,null,null,{"$error":"#N/A"},{"$error":"#N/A"}]
[null,null,null,null,null,null,null,null,null,null,null,null,{"$f":"IF(Data!B61>=D$9,Data!B61-D$9,0)","v":0},{"$f":"IF(S44>0,LN(Data!J61),0)","v":0},0,0,0,0,{"$f":"IF(Data!B61>'B&R'!D$9,1,0)","v":0},{"$error":"#N/A"},null,null,null,null,null,null,{"$error":"#N/A"},{"$error":"#N/A"}]
[null,null,null,null,null,null,null,null,null,null,null,null,{"$f":"IF(Data!B62>=D$9,Data!B62-D$9,0)","v":0},{"$f":"IF(S45>0,LN(Data!J62),0)","v":0},0,0,0,0,{"$f":"IF(Data!B62>'B&R'!D$9,1,0)","v":0},{"$error":"#N/A"},null,null,null,null,null,null,{"$error":"#N/A"},{"$error":"#N/A"}]
[null,null,null,null,null,null,null,null,null,null,null,null,{"$f":"IF(Data!B63>=D$9,Data!B63-D$9,0)","v":0},{"$f":"IF(S46>0,LN(Data!J63),0)","v":0},0,0,0,0,{"$f":"IF(Data!B63>'B&R'!D$9,1,0)","v":0},{"$error":"#N/A"},null,null,null,null,null,null,{"$error":"#N/A"},{"$error":"#N/A"}]
[null,null,null,null,null,null,null,null,null,null,null,null,{"$f":"IF(Data!B64>=D$9,Data!B64-D$9,0)","v":0},{"$f":"IF(S47>0,LN(Data!J64),0)","v":0},0,0,0,0,{"$f":"IF(Data!B64>'B&R'!D$9,1,0)","v":0},{"$error":"#N/A"},null,null,null,null,null,null,{"$error":"#N/A"},{"$error":"#N/A"}]
[null,null,null,null,null,null,null,null,null,null,null,null,{"$f":"IF(Data!B65>=D$9,Data!B65-D$9,0)","v":0},{"$f":"IF(S48>0,LN(Data!J65),0)","v":0},{"$f":"M48^2","v":0},{"$f":"M48*N48","v":0},0,{"$f":"IF(M48>0,(N48-V$11-V$12*M48)/SQRT(V$14),0)","v":0},{"$f":"IF(Data!B65>'B&R'!D$9,1,0)","v":0},{"$f":"IF(S48=0,NA(),EXP(N48)/EXP(V$19))","v":{"$error":"#N/A"}},null,null,null,null,null,null,{"$error":"#N/A"},{"$error":"#N/A"}]
[null,null,null,null,null,null,null,null,null,null,null,null,{"$f":"IF(Data!B66>=D$9,Data!B66-D$9,0)","v":0},{"$f":"IF(S49>0,LN(Data!J66),0)","v":0},0,0,0,0,{"$f":"IF(Data!B66>'B&R'!D$9,1,0)","v":0},{"$error":"#N/A"},null,null,null,null,null,null,{"$error":"#N/A"},{"$error":"#N/A"}]
[null,null,null,null,null,null,null,null,null,null,null,null,{"$f":"IF(Data!B67>=D$9,Data!B67-D$9,0)","v":0},{"$f":"IF(S50>0,LN(Data!J67),0)","v":0},0,0,0,0,{"$f":"IF(Data!B67>'B&R'!D$9,1,0)","v":0},{"$error":"#N/A"},null,null,null,null,null,null,{"$error":"#N/A"},{"$error":"#N/A"}]
[null,null,null,null,null,null,null,null,null,null,null,null,{"$f":"IF(Data!B68>=D$9,Data!B68-D$9,0)","v":0},{"$f":"IF(S51>0,LN(Data!J68),0)","v":0},0,0,0,0,{"$f":"IF(Data!B68>'B&R'!D$9,1,0)","v":0},{"$error":"#N/A"},null,null,null,null,null,null,{"$error":"#N/A"},{"$error":"#N/A"}]
[null,null,null,null,null,null,null,null,null,null,null,null,{"$f":"IF(Data!B69>=D$9,Data!B69-D$9,0)","v":0},{"$f":"IF(S52>0,LN(Data!J69),0)","v":0},0,0,0,0,{"$f":"IF(Data!B69>'B&R'!D$9,1,0)","v":0},{"$error":"#N/A"},null,null,null,null,null,null,{"$error":"#N/A"},{"$error":"#N/A"}]
[null,null,null,null,null,null,null,null,null,null,null,null,{"$f":"IF(Data!B70>=D$9,Data!B70-D$9,0)","v":0},{"$f":"IF(S53>0,LN(Data!J70),0)","v":0},0,0,0,0,{"$f":"IF(Data!B70>'B&R'!D$9,1,0)","v":0},{"$error":"#N/A"},null,null,null,null,null,null,{"$error":"#N/A"},{"$error":"#N/A"}]
[null,null,null,null,null,null,null,null,null,null,null,null,{"$f":"IF(Data!B71>=D$9,Data!B71-D$9,0)","v":0},{"$f":"IF(S54>0,LN(Data!J71),0)","v":0},0,0,0,0,{"$f":"IF(Data!B71>'B&R'!D$9,1,0)","v":0},{"$error":"#N/A"},null,null,null,null,null,null,{"$error":"#N/A"},{"$error":"#N/A"}]
[null,null,null,null,null,null,null,null,null,null,null,null,{"$f":"IF(Data!B72>=D$9,Data!B72-D$9,0)","v":0},{"$f":"IF(S55>0,LN(Data!J72),0)","v":0},0,0,0,0,{"$f":"IF(Data!B72>'B&R'!D$9,1,0)","v":0},{"$error":"#N/A"},null,null,null,null,null,null,{"$error":"#N/A"},{"$error":"#N/A"}]
[null,null,null,null,null,null,null,null,null,null,null,null,{"$f":"IF(Data!B73>=D$9,Data!B73-D$9,0)","v":0},{"$f":"IF(S56>0,LN(Data!J73),0)","v":0},0,0,0,0,{"$f":"IF(Data!B73>'B&R'!D$9,1,0)","v":0},{"$error":"#N/A"},null,null,null,null,null,null,{"$error":"#N/A"},{"$error":"#N/A"}]
[null,null,null,null,null,null,null,null,null,null,null,null,{"$f":"IF(Data!B74>=D$9,Data!B74-D$9,0)","v":0},{"$f":"IF(S57>0,LN(Data!J74),0)","v":0},0,0,0,0,{"$f":"IF(Data!B74>'B&R'!D$9,1,0)","v":0},{"$error":"#N/A"},null,null,null,null,null,null,{"$error":"#N/A"},{"$error":"#N/A"}]
[null,null,null,null,null,null,null,null,null,null,null,null,{"$f":"IF(Data!B75>=D$9,Data!B75-D$9,0)","v":0},{"$f":"IF(S58>0,LN(Data!J75),0)","v":0},0,0,0,0,{"$f":"IF(Data!B75>'B&R'!D$9,1,0)","v":0},{"$error":"#N/A"},null,null,null,null,null,null,{"$error":"#N/A"},{"$error":"#N/A"}]
[null,null,null,null,null,null,null,null,null,null,null,null,{"$f":"IF(Data!B76>=D$9,Data!B76-D$9,0)","v":0},{"$f":"IF(S59>0,LN(Data!J76),0)","v":0},0,0,0,0,{"$f":"IF(Data!B76>'B&R'!D$9,1,0)","v":0},{"$error":"#N/A"},null,null,null,null,null,null,{"$error":"#N/A"},{"$error":"#N/A"}]
[null,null,null,null,null,null,null,null,null,null,null,null,{"$f":"IF(Data!B77>=D$9,Data!B77-D$9,0)","v":0},{"$f":"IF(S60>0,LN(Data!J77),0)","v":0},0,0,0,0,{"$f":"IF(Data!B77>'B&R'!D$9,1,0)","v":0},{"$error":"#N/A"},null,null,null,null,null,null,{"$error":"#N/A"},{"$error":"#N/A"}]
[null,null,null,null,null,null,null,null,null,null,null,null,{"$f":"IF(Data!B78>=D$9,Data!B78-D$9,0)","v":0},{"$f":"IF(S61>0,LN(Data!J78),0)","v":0},{"$f":"M61^2","v":0},{"$f":"M61*N61","v":0},0,{"$f":"IF(M61>0,(N61-V$11-V$12*M61)/SQRT(V$14),0)","v":0},{"$f":"IF(Data!B78>'B&R'!D$9,1,0)","v":0},{"$f":"IF(S61=0,NA(),EXP(N61)/EXP(V$19))","v":{"$error":"#N/A"}},null,null,null,null,null,null,{"$error":"#N/A"},{"$error":"#N/A"}]
[null,null,null,null,null,null,null,null,null,null,null,null,{"$f":"IF(Data!B79>=D$9,Data!B79-D$9,0)","v":0},{"$f":"IF(S62>0,LN(Data!J79),0)","v":0},0,0,0,0,{"$f":"IF(Data!B79>'B&R'!D$9,1,0)","v":0},{"$error":"#N/A"},null,null,null,null,null,null,{"$error":"#N/A"},{"$error":"#N/A"}]
[null,null,null,null,null,null,null,null,null,null,null,null,{"$f":"IF(Data!B80>=D$9,Data!B80-D$9,0)","v":0},{"$f":"IF(S63>0,LN(Data!J80),0)","v":0},0,0,0,0,{"$f":"IF(Data!B80>'B&R'!D$9,1,0)","v":0},{"$error":"#N/A"},null,null,null,null,null,null,{"$error":"#N/A"},{"$error":"#N/A"}]
[null,null,null,null,null,null,null,null,null,null,null,null,{"$f":"IF(Data!B81>=D$9,Data!B81-D$9,0)","v":0},{"$f":"IF(S64>0,LN(Data!J81),0)","v":0},0,0,0,0,{"$f":"IF(Data!B81>'B&R'!D$9,1,0)","v":0},{"$error":"#N/A"},null,null,null,null,null,null,{"$error":"#N/A"},{"$error":"#N/A"}]

{"sheet":"C&J","index":4,"n_rows":66,"n_cols":26,"rows_kept":66,"cut":false,"hidden":false,"merged":[]}
["Cooper and Jacob (1946)"]
["Well Designation:",null,{"$f":"IF(Data!B1 > 0,Data!B1,\"\")","v":"YYY"},null,null,null,null,null,null,null,null,null,null,null,null,null,null,null,null,null,null,null,{"$f":"E10","v":15},{"$f":"E9","v":25},0]
["Date:",null,{"$f":"IF(Data!B2 > 0,Data!B2,\"\")","v":"date"},null,null,null,null,null,null,null,null,null,null,null,null,0,{"$f":"MAX(P9:Q58)","v":1526.0826039977655},null,null,null,null,null,{"$f":"W2","v":15},{"$f":"X2","v":25},{"$f":"J50","v":70}]
[null,null,null,null,null,null,null,null,null,null,null,null,null,null,null,0,{"$f":"Q3","v":1526.0826039977655}]
[null,null,null,null,null,null,null,null,null,null,null,null,null,null,null,null,null,null,null,null,null,null,null,{"$f":"MAX(T9:T66)+10","v":41835}]
[]
[null,null,null,null,null,null,null,null,null,null,null,null,null,"Index","ti","Vi (meas)","Vi (calc)","SE",null,"Time","Qn/sn",null,"Index","Time","Qn/sn","A-Time"]
[null,"Enter early time cut-off for least-squares model fit"]
[null,null,"    Timecut (min):",null,25,"<-  Enter or change values here",null,null,null,null,null,null,null,1,{"$f":"IF(Data!L24>=E$9,Data!L24-E$10,0)","v":0},{"$f":"IF(O9>0,7.48*Data!M24*(Data!B24-Data!B23)/1440,0)","v":0},{"$f":"IF(O9>0,7.48*(4*PI()*(E$16/1440)*Data!N24)*(Data!B24-Data!B23)/LN(0.56146/((Data!P24^2*'C&J'!E$15)/(4*('C&J'!E$16/1440)*O9))),0)","v":0},{"$f":"(P9-Q9)^2","v":0},null,{"$f":"Data!L24","v":1.5},{"$f":"Data!M24/Data!N24","v":4.3801051420241341},null,0,{"$f":"2+(X$5-2)*W9/50","v":2},{"$f":"4*PI()*E$18/LN(0.56146/(Data!V$23^2*'C&J'!E$15/(4*'C&J'!E$18*'C&J'!X9/1440)))","v":20.493506953590142},{"$f":"X9+E$10","v":17}]
[null,"  Time Adjustment (min):",null,null,15,null,null,null,null,null,null,null,null,2,{"$f":"IF(Data!L25>=E$9,Data!L25-E$10,0)","v":0},{"$f":"IF(O10>0,P9+7.48*Data!M25*(Data!B25-Data!B24)/1440,0)","v":0},{"$f":"IF(O10>0,Q9+7.48*(4*PI()*(E$16/1440)*Data!N25)*(Data!B25-Data!B24)/LN(0.56146/((Data!P25^2*'C&J'!E$15)/(4*('C&J'!E$16/1440)*O10))),0)","v":0},{"$f":"(P10-Q10)^2","v":0},null,{"$f":"Data!L25","v":2.5},{"$f":"Data!M25/Data!N25","v":2.8542038519458557},null,1,{"$f":"2+(X$5-2)*W10/50","v":838.66},{"$f":"4*PI()*E$18/LN(0.56146/(Data!V$23^2*'C&J'!E$15/(4*'C&J'!E$18*'C&J'!X10/1440)))","v":5.4220907112828716},{"$f":"X10+E$10","v":853.66}]
[null,null,null,null,null,null,null,null,null,null,null,null,null,3,{"$f":"IF(Data!L26>=E$9,Data!L26-E$10,0)","v":0},{"$f":"IF(O11>0,P10+7.48*Data!M26*(Data!B26-Data!B25)/1440,0)","v":0},{"$f":"IF(O11>0,Q10+7.48*(4*PI()*(E$16/1440)*Data!N26)*(Data!B26-Data!B25)/LN(0.56146/((Data!P26^2*'C&J'!E$15)/(4*('C&J'!E$16/1440)*O11))),0)","v":0},0,null,{"$f":"Data!L26","v":3.5},{"$f":"Data!M26/Data!N26","v":3.5588354278943979},null,2,1675.32,{"$f":"4*PI()*E$18/LN(0.56146/(Data!V$23^2*'C&J'!E$15/(4*'C&J'!E$18*'C&J'!X11/1440)))","v":5.0006816932243048},1690.32]
[null,"Trial Sn:",null,null,0.05,"<-- Enter d for default or enter Sn value",null,null,null,null,null,null,null,4,{"$f":"IF(Data!L27>=E$9,Data!L27-E$10,0)","v":0},{"$f":"IF(O12>0,P11+7.48*Data!M27*(Data!B27-Data!B26)/1440,0)","v":0},{"$f":"IF(O12>0,Q11+7.48*(4*PI()*(E$16/1440)*Data!N27)*(Data!B27-Data!B26)/LN(0.56146/((Data!P27^2*'C&J'!E$15)/(4*('C&J'!E$16/1440)*O12))),0)","v":0},0,null,{"$f":"Data!L27","v":4.5},{"$f":"Data!M27/Data!N27","v":2.4556923707309495},null,3,2511.98,{"$f":"4*PI()*E$18/LN(0.56146/(Data!V$23^2*'C&J'!E$15/(4*'C&J'!E$18*'C&J'!X12/1440)))","v":4.7830646135189481},2526.98]
[null,null,null,null,null,null,null,null,null,null,null,null,null,5,{"$f":"IF(Data!L28>=E$9,Data!L28-E$10,0)","v":0},{"$f":"IF(O13>0,P12+7.48*Data!M28*(Data!B28-Data!B27)/1440,0)","v":0},{"$f":"IF(O13>0,Q12+7.48*(4*PI()*(E$16/1440)*Data!N28)*(Data!B28-Data!B27)/LN(0.56146/((Data!P28^2*'C&J'!E$15)/(4*('C&J'!E$16/1440)*O13))),0)","v":0},0,null,{"$f":"Data!L28","v":5.5},{"$f":"Data!M28/Data!N28","v":2.5237170901413317},null,4,3348.64,{"$f":"4*PI()*E$18/LN(0.56146/(Data!V$23^2*'C&J'!E$15/(4*'C&J'!E$18*'C&J'!X13/1440)))","v":4.6397650177190188},3363.64]
[null,"Root-Mean-Square Error:",null,null,{"$f":"SQRT(SUM(R9:R58))","v":1768.4559353792874},"<-- Minimize this using \"Solver\"",null,null,null,null,null,null,null,6,{"$f":"IF(Data!L29>=E$9,Data!L29-E$10,0)","v":0},{"$f":"IF(O14>0,P13+7.48*Data!M29*(Data!B29-Data!B28)/1440,0)","v":0},{"$f":"IF(O14>0,Q13+7.48*(4*PI()*(E$16/1440)*Data!N29)*(Data!B29-Data!B28)/LN(0.56146/((Data!P29^2*'C&J'!E$15)/(4*('C&J'!E$16/1440)*O14))),0)","v":0},0,null,{"$f":"Data!L29","v":6.5},{"$f":"Data!M29/Data!N29","v":2.595617861940231},null,5,4185.3,{"$f":"4*PI()*E$18/LN(0.56146/(Data!V$23^2*'C&J'!E$15/(4*'C&J'!E$18*'C&J'!X14/1440)))","v":4.5343758828098712},4200.3]
[null,null,null,null,{"$f":"IF(E12=\"d\",0.025*SQRT(E16),E12)","v":0.05},"<-- Working Sn",null,null,null,null,null,null,null,7,{"$f":"IF(Data!L30>=E$9,Data!L30-E$10,0)","v":0},{"$f":"IF(O15>0,P14+7.48*Data!M30*(Data!B30-Data!B29)/1440,0)","v":0},{"$f":"IF(O15>0,Q14+7.48*(4*PI()*(E$16/1440)*Data!N30)*(Data!B30-Data!B29)/LN(0.56146/((Data!P30^2*'C&J'!E$15)/(4*('C&J'!E$16/1440)*O15))),0)","v":0},0,null,{"$f":"Data!L30","v":7.5},{"$f":"Data!M30/Data!N30","v":2.6717356878035821},null,6,5021.96,{"$f":"4*PI()*E$18/LN(0.56146/(Data!V$23^2*'C&J'!E$15/(4*'C&J'!E$18*'C&J'!X15/1440)))","v":4.4517479481678244},5036.96]
[null,"Trial Tn (ft2/d):",null,null,3.5429056134452672,"<-- By changing Tn through \"Solver\"",null,null,null,null,null,null,null,8,{"$f":"IF(Data!L31>=E$9,Data!L31-E$10,0)","v":0},{"$f":"IF(O16>0,P15+7.48*Data!M31*(Data!B31-Data!B30)/1440,0)","v":0},{"$f":"IF(O16>0,Q15+7.48*(4*PI()*(E$16/1440)*Data!N31)*(Data!B31-Data!B30)/LN(0.56146/((Data!P31^2*'C&J'!E$15)/(4*('C&J'!E$16/1440)*O16))),0)","v":0},0,null,{"$f":"Data!L31","v":8.5},{"$f":"Data!M31/Data!N31","v":2.7524527780695469},null,7,5858.62,{"$f":"4*PI()*E$18/LN(0.56146/(Data!V$23^2*'C&J'!E$15/(4*'C&J'!E$18*'C&J'!X16/1440)))","v":4.3841962562268835},5873.62]
[null,null,null,null,null,null,"Add constraint Tn > 0.00001",null,null,null,null,null,null,9,{"$f":"IF(Data!L32>=E$9,Data!L32-E$10,0)","v":0},{"$f":"IF(O17>0,P16+7.48*Data!M32*(Data!B32-Data!B31)/1440,0)","v":0},{"$f":"IF(O17>0,Q16+7.48*(4*PI()*(E$16/1440)*Data!N32)*(Data!B32-Data!B31)/LN(0.56146/((Data!P32^2*'C&J'!E$15)/(4*('C&J'!E$16/1440)*O17))),0)","v":0},0,null,{"$f":"Data!L32","v":9.5},{"$f":"Data!M32/Data!N32","v":5.6763979410660514},null,8,6695.28,{"$f":"4*PI()*E$18/LN(0.56146/(Data!V$23^2*'C&J'!E$15/(4*'C&J'!E$18*'C&J'!X17/1440)))","v":4.3273131334359007},6710.28]
[null,"Model Result:",null,"Tn (ft2/d) =",{"$f":"E16","v":3.5429056134452672},null,null,null,null,null,null,null,null,10,{"$f":"IF(Data!L33>=E$9,Data!L33-E$10,0)","v":0},{"$f":"IF(O18>0,P17+7.48*Data!M33*(Data!B33-Data!B32)/1440,0)","v":0},{"$f":"IF(O18>0,Q17+7.48*(4*PI()*(E$16/1440)*Data!N33)*(Data!B33-Data!B32)/LN(0.56146/((Data!P33^2*'C&J'!E$15)/(4*('C&J'!E$16/1440)*O18))),0)","v":0},0,null,{"$f":"Data!L33","v":15},{"$f":"Data!M33/Data!N33","v":0.50937963951975351},null,9,7531.94,{"$f":"4*PI()*E$18/LN(0.56146/(Data!V$23^2*'C&J'!E$15/(4*'C&J'!E$18*'C&J'!X18/1440)))","v":4.278348180320604},7546.94]
[null,null,null,null,null,null,null,null,null,null,null,null,null,11,{"$f":"IF(Data!L34>=E$9,Data!L34-E$10,0)","v":0},{"$f":"IF(O19>0,P18+7.48*Data!M34*(Data!B34-Data!B33)/1440,0)","v":0},{"$f":"IF(O19>0,Q18+7.48*(4*PI()*(E$16/1440)*Data!N34)*(Data!B34-Data!B33)/LN(0.56146/((Data!P34^2*'C&J'!E$15)/(4*('C&J'!E$16/1440)*O19))),0)","v":0},0,null,{"$f":"Data!L34","v":23},{"$f":"Data!M34/Data!N34","v":1.3557468296740727},null,10,8368.6,{"$f":"4*PI()*E$18/LN(0.56146/(Data!V$23^2*'C&J'!E$15/(4*'C&J'!E$18*'C&J'!X19/1440)))","v":4.2354758287607064},8383.6]
[null,null,null,null,null,null,null,null,null,null,null,null,null,12,{"$f":"IF(Data!L35>=E$9,Data!L35-E$10,0)","v":13},{"$f":"IF(O20>0,P19+7.48*Data!M35*(Data!B35-Data!B34)/1440,0)","v":3.5493452000871027E-2},{"$f":"IF(O20>0,Q19+7.48*(4*PI()*(E$16/1440)*Data!N35)*(Data!B35-Data!B34)/LN(0.56146/((Data!P35^2*'C&J'!E$15)/(4*('C&J'!E$16/1440)*O20))),0)","v":0.34881756597540475},9.8172000397926618E-2,null,{"$f":"Data!L35","v":28},{"$f":"Data!M35/Data!N35","v":1.1201580363209918},null,11,9205.26,{"$f":"4*PI()*E$18/LN(0.56146/(Data!V$23^2*'C&J'!E$15/(4*'C&J'!E$18*'C&J'!X20/1440)))","v":4.1974257064700788},9220.26]
[null,null,null,null,null,null,null,null,null,null,null,null,null,13,{"$f":"IF(Data!L36>=E$9,Data!L36-E$10,0)","v":20},{"$f":"IF(O21>0,P20+7.48*Data!M36*(Data!B36-Data!B35)/1440,0)","v":0.10056478066913599},{"$f":"IF(O21>0,Q20+7.48*(4*PI()*(E$16/1440)*Data!N36)*(Data!B36-Data!B35)/LN(0.56146/((Data!P36^2*'C&J'!E$15)/(4*('C&J'!E$16/1440)*O21))),0)","v":1.1239960829370219},1.0474116304617407,null,{"$f":"Data!L36","v":35},{"$f":"Data!M36/Data!N36","v":0.83514004707933631},null,12,10041.92,{"$f":"4*PI()*E$18/LN(0.56146/(Data!V$23^2*'C&J'!E$15/(4*'C&J'!E$18*'C&J'!X21/1440)))","v":4.1632800973930735},10056.92]
[null,null,null,null,null,null,null,null,null,null,null,null,null,14,{"$f":"IF(Data!L37>=E$9,Data!L37-E$10,0)","v":30},{"$f":"IF(O22>0,P21+7.48*Data!M37*(Data!B37-Data!B36)/1440,0)","v":0.16563610933739253},{"$f":"IF(O22>0,Q21+7.48*(4*PI()*(E$16/1440)*Data!N37)*(Data!B37-Data!B36)/LN(0.56146/((Data!P37^2*'C&J'!E$15)/(4*('C&J'!E$16/1440)*O22))),0)","v":1.8181892592345417},2.7309319132349894,null,{"$f":"Data!L37","v":45},{"$f":"Data!M37/Data!N37","v":0.85509219837463668},null,13,10878.58,{"$f":"4*PI()*E$18/LN(0.56146/(Data!V$23^2*'C&J'!E$15/(4*'C&J'!E$18*'C&J'!X22/1440)))","v":4.1323556100114507},10893.58]
[null,null,null,null,null,null,null,null,null,null,null,null,null,15,{"$f":"IF(Data!L38>=E$9,Data!L38-E$10,0)","v":40},{"$f":"IF(O23>0,P22+7.48*Data!M38*(Data!B38-Data!B37)/1440,0)","v":0.2366230133391346},{"$f":"IF(O23>0,Q22+7.48*(4*PI()*(E$16/1440)*Data!N38)*(Data!B38-Data!B37)/LN(0.56146/((Data!P38^2*'C&J'!E$15)/(4*('C&J'!E$16/1440)*O23))),0)","v":2.4603166758939352},4.9448135048863842,null,{"$f":"Data!L38","v":55},{"$f":"Data!M38/Data!N38","v":0.95232948035652243},null,14,11715.24,{"$f":"4*PI()*E$18/LN(0.56146/(Data!V$23^2*'C&J'!E$15/(4*'C&J'!E$18*'C&J'!X23/1440)))","v":4.1041303886741494},11730.24]
[null,null,null,null,null,null,null,null,null,null,null,null,null,16,{"$f":"IF(Data!L39>=E$9,Data!L39-E$10,0)","v":50},{"$f":"IF(O24>0,P23+7.48*Data!M39*(Data!B39-Data!B38)/1440,0)","v":0.26028531467304722},{"$f":"IF(O24>0,Q23+7.48*(4*PI()*(E$16/1440)*Data!N39)*(Data!B39-Data!B38)/LN(0.56146/((Data!P39^2*'C&J'!E$15)/(4*('C&J'!E$16/1440)*O24))),0)","v":3.0651430578206642},7.8672269592951434,null,{"$f":"Data!L39","v":65},{"$f":"Data!M39/Data!N39","v":0.32307158494362431},null,15,12551.9,{"$f":"4*PI()*E$18/LN(0.56146/(Data!V$23^2*'C&J'!E$15/(4*'C&J'!E$18*'C&J'!X24/1440)))","v":4.0781974030339248},12566.9]
[null,null,null,null,null,null,null,null,null,null,null,null,null,17,{"$f":"IF(Data!L40>=E$9,Data!L40-E$10,0)","v":60},{"$f":"IF(O25>0,P24+7.48*Data!M40*(Data!B40-Data!B39)/1440,0)","v":0.28986319134043692},{"$f":"IF(O25>0,Q24+7.48*(4*PI()*(E$16/1440)*Data!N40)*(Data!B40-Data!B39)/LN(0.56146/((Data!P40^2*'C&J'!E$15)/(4*('C&J'!E$16/1440)*O25))),0)","v":3.6418863447390573},11.236059220920431,null,{"$f":"Data!L40","v":75},{"$f":"Data!M40/Data!N40","v":0.4096501211964873},null,16,13388.56,{"$f":"4*PI()*E$18/LN(0.56146/(Data!V$23^2*'C&J'!E$15/(4*'C&J'!E$18*'C&J'!X25/1440)))","v":4.0542333907526134},13403.56]
[null,null,null,null,null,null,null,null,null,null,null,null,null,18,{"$f":"IF(Data!L41>=E$9,Data!L41-E$10,0)","v":70},{"$f":"IF(O26>0,P25+7.48*Data!M41*(Data!B41-Data!B40)/1440,0)","v":0.31352549267435376},{"$f":"IF(O26>0,Q25+7.48*(4*PI()*(E$16/1440)*Data!N41)*(Data!B41-Data!B40)/LN(0.56146/((Data!P41^2*'C&J'!E$15)/(4*('C&J'!E$16/1440)*O26))),0)","v":4.1970515931512669},15.08177497308542,null,{"$f":"Data!L41","v":85},{"$f":"Data!M41/Data!N41","v":0.33129522528770272},null,17,14225.22,{"$f":"4*PI()*E$18/LN(0.56146/(Data!V$23^2*'C&J'!E$15/(4*'C&J'!E$18*'C&J'!X26/1440)))","v":4.0319775760233698},14240.22]
[null,null,null,null,null,null,null,null,null,null,null,null,null,19,{"$f":"IF(Data!L42>=E$9,Data!L42-E$10,0)","v":80},{"$f":"IF(O27>0,P26+7.48*Data!M42*(Data!B42-Data!B41)/1440,0)","v":0.33718779400826637},{"$f":"IF(O27>0,Q26+7.48*(4*PI()*(E$16/1440)*Data!N42)*(Data!B42-Data!B41)/LN(0.56146/((Data!P42^2*'C&J'!E$15)/(4*('C&J'!E$16/1440)*O27))),0)","v":4.7356236544424162},19.346238018353098,null,{"$f":"Data!L42","v":95},{"$f":"Data!M42/Data!N42","v":0.33372229653517277},null,18,15061.88,{"$f":"4*PI()*E$18/LN(0.56146/(Data!V$23^2*'C&J'!E$15/(4*'C&J'!E$18*'C&J'!X27/1440)))","v":4.0112167034217441},15076.88]
[null,null,null,null,null,null,null,null,null,null,null,null,null,20,{"$f":"IF(Data!L43>=E$9,Data!L43-E$10,0)","v":535},{"$f":"IF(O28>0,P27+7.48*Data!M43*(Data!B43-Data!B42)/1440,0)","v":0.62705098534870329},{"$f":"IF(O28>0,Q27+7.48*(4*PI()*(E$16/1440)*Data!N43)*(Data!B43-Data!B42)/LN(0.56146/((Data!P43^2*'C&J'!E$15)/(4*('C&J'!E$16/1440)*O28))),0)","v":41.340017077545816},1657.5456080243919,null,{"$f":"Data!L43","v":550},{"$f":"Data!M43/Data!N43","v":4.5423312583955225E-2},null,19,15898.54,{"$f":"4*PI()*E$18/LN(0.56146/(Data!V$23^2*'C&J'!E$15/(4*'C&J'!E$18*'C&J'!X28/1440)))","v":3.9917742725796859},15913.54]
[null,null,null,null,null,null,null,null,null,null,null,null,null,21,{"$f":"IF(Data!L44>=E$9,Data!L44-E$10,0)","v":1710},{"$f":"IF(O29>0,P28+7.48*Data!M44*(Data!B44-Data!B43)/1440,0)","v":0.69212231401696411},{"$f":"IF(O29>0,Q28+7.48*(4*PI()*(E$16/1440)*Data!N44)*(Data!B44-Data!B43)/LN(0.56146/((Data!P44^2*'C&J'!E$15)/(4*('C&J'!E$16/1440)*O29))),0)","v":94.889201989116827},8873.0898193171106,null,{"$f":"Data!L44","v":1725},{"$f":"Data!M44/Data!N44","v":6.0627226648223885E-3},null,20,16735.2,{"$f":"4*PI()*E$18/LN(0.56146/(Data!V$23^2*'C&J'!E$15/(4*'C&J'!E$18*'C&J'!X29/1440)))","v":3.973502639386056},16750.2]
[null,null,null,null,null,null,null,null,null,null,null,null,null,22,{"$f":"IF(Data!L45>=E$9,Data!L45-E$10,0)","v":3160},{"$f":"IF(O30>0,P29+7.48*Data!M45*(Data!B45-Data!B44)/1440,0)","v":0.71578461535087257},{"$f":"IF(O30>0,Q29+7.48*(4*PI()*(E$16/1440)*Data!N45)*(Data!B45-Data!B44)/LN(0.56146/((Data!P45^2*'C&J'!E$15)/(4*('C&J'!E$16/1440)*O30))),0)","v":147.27596670413655},21479.88697389801,null,{"$f":"Data!L45","v":3175},{"$f":"Data!M45/Data!N45","v":2.1084514453618597E-3},null,21,17571.86,{"$f":"4*PI()*E$18/LN(0.56146/(Data!V$23^2*'C&J'!E$15/(4*'C&J'!E$18*'C&J'!X30/1440)))","v":3.9562771176962275},17586.86]
[null,null,null,null,null,null,null,null,null,null,null,null,null,23,{"$f":"IF(Data!L46>=E$9,Data!L46-E$10,0)","v":4610},{"$f":"IF(O31>0,P30+7.48*Data!M46*(Data!B46-Data!B45)/1440,0)","v":0.81043382068652725},{"$f":"IF(O31>0,Q30+7.48*(4*PI()*(E$16/1440)*Data!N46)*(Data!B46-Data!B45)/LN(0.56146/((Data!P46^2*'C&J'!E$15)/(4*('C&J'!E$16/1440)*O31))),0)","v":194.792735012121},37629.133175524395,null,{"$f":"Data!L46","v":4625},{"$f":"Data!M46/Data!N46","v":8.9440360244551261E-3},null,22,18408.52,{"$f":"4*PI()*E$18/LN(0.56146/(Data!V$23^2*'C&J'!E$15/(4*'C&J'!E$18*'C&J'!X31/1440)))","v":3.9399915053132983},18423.52]
[null,null,null,null,null,null,null,null,null,null,null,null,null,24,{"$f":"IF(Data!L47>=E$9,Data!L47-E$10,0)","v":17280},{"$f":"IF(O32>0,P31+7.48*Data!M47*(Data!B47-Data!B46)/1440,0)","v":0.85775842335435248},{"$f":"IF(O32>0,Q31+7.48*(4*PI()*(E$16/1440)*Data!N47)*(Data!B47-Data!B46)/LN(0.56146/((Data!P47^2*'C&J'!E$15)/(4*('C&J'!E$16/1440)*O32))),0)","v":856.11190065575579},731459.64780568087,null,{"$f":"Data!L47","v":17295},{"$f":"Data!M47/Data!N47","v":2.8353680189748833E-4},null,23,19245.18,{"$f":"4*PI()*E$18/LN(0.56146/(Data!V$23^2*'C&J'!E$15/(4*'C&J'!E$18*'C&J'!X32/1440)))","v":3.9245546422402233},19260.18]
[null,null,null,null,null,null,null,null,null,null,null,null,null,25,{"$f":"IF(Data!L48>=E$9,Data!L48-E$10,0)","v":41810},{"$f":"IF(O33>0,P32+7.48*Data!M48*(Data!B48-Data!B47)/1440,0)","v":0.86958957402131087},{"$f":"IF(O33>0,Q32+7.48*(4*PI()*(E$16/1440)*Data!N48)*(Data!B48-Data!B47)/LN(0.56146/((Data!P48^2*'C&J'!E$15)/(4*('C&J'!E$16/1440)*O33))),0)","v":1526.0826039977655},2326274.7393675647,null,{"$f":"Data!L48","v":41825},{"$f":"Data!M48/Data!N48","v":6.4867992243509918E-5},null,24,20081.84,{"$f":"4*PI()*E$18/LN(0.56146/(Data!V$23^2*'C&J'!E$15/(4*'C&J'!E$18*'C&J'!X33/1440)))","v":3.9098877291952019},20096.84]
[null,null,null,null,null,null,null,null,null,null,null,null,null,26,{"$f":"IF(Data!L49>=E$9,Data!L49-E$10,0)","v":0},{"$f":"IF(O34>0,P33+7.48*Data!M49*(Data!B49-Data!B48)/1440,0)","v":0},{"$f":"IF(O34>0,Q33+7.48*(4*PI()*(E$16/1440)*Data!N49)*(Data!B49-Data!B48)/LN(0.56146/((Data!P49^2*'C&J'!E$15)/(4*('C&J'!E$16/1440)*O34))),0)","v":0},0,null,{"$f":"Data!L49","v":0},{"$f":"Data!M49/Data!N49","v":{"$error":"#N/A"}},null,25,20918.5,{"$f":"4*PI()*E$18/LN(0.56146/(Data!V$23^2*'C&J'!E$15/(4*'C&J'!E$18*'C&J'!X34/1440)))","v":3.8959222142434715},20933.5]
[null,null,null,null,null,null,null,null,null,null,null,null,null,27,{"$f":"IF(Data!L50>=E$9,Data!L50-E$10,0)","v":0},{"$f":"IF(O35>0,P34+7.48*Data!M50*(Data!B50-Data!B49)/1440,0)","v":0},{"$f":"IF(O35>0,Q34+7.48*(4*PI()*(E$16/1440)*Data!N50)*(Data!B50-Data!B49)/LN(0.56146/((Data!P50^2*'C&J'!E$15)/(4*('C&J'!E$16/1440)*O35))),0)","v":0},0,null,{"$f":"Data!L50","v":0},{"$f":"Data!M50/Data!N50","v":{"$error":"#N/A"}},null,26,21755.16,{"$f":"4*PI()*E$18/LN(0.56146/(Data!V$23^2*'C&J'!E$15/(4*'C&J'!E$18*'C&J'!X35/1440)))","v":3.8825981095981179},21770.16]
[null,null,null,null,null,null,null,null,null,null,null,null,null,28,{"$f":"IF(Data!L51>=E$9,Data!L51-E$10,0)","v":0},{"$f":"IF(O36>0,P35+7.48*Data!M51*(Data!B51-Data!B50)/1440,0)","v":0},{"$f":"IF(O36>0,Q35+7.48*(4*PI()*(E$16/1440)*Data!N51)*(Data!B51-Data!B50)/LN(0.56146/((Data!P51^2*'C&J'!E$15)/(4*('C&J'!E$16/1440)*O36))),0)","v":0},0,null,{"$f":"Data!L51","v":0},{"$f":"Data!M51/Data!N51","v":{"$error":"#N/A"}},null,27,22591.82,{"$f":"4*PI()*E$18/LN(0.56146/(Data!V$23^2*'C&J'!E$15/(4*'C&J'!E$18*'C&J'!X36/1440)))","v":3.8698626380840362},22606.82]
[null,null,null,null,null,null,null,null,null,null,null,null,null,29,{"$f":"IF(Data!L52>=E$9,Data!L52-E$10,0)","v":0},{"$f":"IF(O37>0,P36+7.48*Data!M52*(Data!B52-Data!B51)/1440,0)","v":0},{"$f":"IF(O37>0,Q36+7.48*(4*PI()*(E$16/1440)*Data!N52)*(Data!B52-Data!B51)/LN(0.56146/((Data!P52^2*'C&J'!E$15)/(4*('C&J'!E$16/1440)*O37))),0)","v":0},0,null,{"$f":"Data!L52","v":0},{"$f":"Data!M52/Data!N52","v":{"$error":"#N/A"}},null,28,23428.48,{"$f":"4*PI()*E$18/LN(0.56146/(Data!V$23^2*'C&J'!E$15/(4*'C&J'!E$18*'C&J'!X37/1440)))","v":3.8576691350455081},23443.48]
[null,null,null,null,null,null,null,null,null,null,null,null,null,30,{"$f":"IF(Data!L53>=E$9,Data!L53-E$10,0)","v":0},{"$f":"IF(O38>0,P37+7.48*Data!M53*(Data!B53-Data!B52)/1440,0)","v":0},{"$f":"IF(O38>0,Q37+7.48*(4*PI()*(E$16/1440)*Data!N53)*(Data!B53-Data!B52)/LN(0.56146/((Data!P53^2*'C&J'!E$15)/(4*('C&J'!E$16/1440)*O38))),0)","v":0},0,null,{"$f":"Data!L53","v":0},{"$f":"Data!M53/Data!N53","v":{"$error":"#N/A"}},null,29,24265.14,{"$f":"4*PI()*E$18/LN(0.56146/(Data!V$23^2*'C&J'!E$15/(4*'C&J'!E$18*'C&J'!X38/1440)))","v":3.8459761502075276},24280.14]
[null,null,null,null,null,null,null,null,null,null,null,null,null,31,{"$f":"IF(Data!L54>=E$9,Data!L54-E$10,0)","v":0},{"$f":"IF(O39>0,P38+7.48*Data!M54*(Data!B54-Data!B53)/1440,0)","v":0},{"$f":"IF(O39>0,Q38+7.48*(4*PI()*(E$16/1440)*Data!N54)*(Data!B54-Data!B53)/LN(0.56146/((Data!P54^2*'C&J'!E$15)/(4*('C&J'!E$16/1440)*O39))),0)","v":0},0,null,{"$f":"Data!L54","v":0},{"$f":"Data!M54/Data!N54","v":{"$error":"#N/A"}},null,30,25101.8,{"$f":"4*PI()*E$18/LN(0.56146/(Data!V$23^2*'C&J'!E$15/(4*'C&J'!E$18*'C&J'!X39/1440)))","v":3.8347467075290647},25116.799999999999]
[null,null,null,null,null,null,null,null,null,null,null,null,null,32,{"$f":"IF(Data!L55>=E$9,Data!L55-E$10,0)","v":0},{"$f":"IF(O40>0,P39+7.48*Data!M55*(Data!B55-Data!B54)/1440,0)","v":0},{"$f":"IF(O40>0,Q39+7.48*(4*PI()*(E$16/1440)*Data!N55)*(Data!B55-Data!B54)/LN(0.56146/((Data!P55^2*'C&J'!E$15)/(4*('C&J'!E$16/1440)*O40))),0)","v":0},0,null,{"$f":"Data!L55","v":0},{"$f":"Data!M55/Data!N55","v":{"$error":"#N/A"}},null,31,25938.46,{"$f":"4*PI()*E$18/LN(0.56146/(Data!V$23^2*'C&J'!E$15/(4*'C&J'!E$18*'C&J'!X40/1440)))","v":3.823947690980718},25953.46]
[null,null,null,null,null,null,null,null,null,null,null,null,null,33,{"$f":"IF(Data!L56>=E$9,Data!L56-E$10,0)","v":0},{"$f":"IF(O41>0,P40+7.48*Data!M56*(Data!B56-Data!B55)/1440,0)","v":0},{"$f":"IF(O41>0,Q40+7.48*(4*PI()*(E$16/1440)*Data!N56)*(Data!B56-Data!B55)/LN(0.56146/((Data!P56^2*'C&J'!E$15)/(4*('C&J'!E$16/1440)*O41))),0)","v":0},0,null,{"$f":"Data!L56","v":0},{"$f":"Data!M56/Data!N56","v":{"$error":"#N/A"}},null,32,26775.119999999999,{"$f":"4*PI()*E$18/LN(0.56146/(Data!V$23^2*'C&J'!E$15/(4*'C&J'!E$18*'C&J'!X41/1440)))","v":3.8135493315002833},26790.12]
[null,null,null,null,null,null,null,null,null,null,null,null,null,34,{"$f":"IF(Data!L57>=E$9,Data!L57-E$10,0)","v":0},{"$f":"IF(O42>0,P41+7.48*Data!M57*(Data!B57-Data!B56)/1440,0)","v":0},{"$f":"IF(O42>0,Q41+7.48*(4*PI()*(E$16/1440)*Data!N57)*(Data!B57-Data!B56)/LN(0.56146/((Data!P57^2*'C&J'!E$15)/(4*('C&J'!E$16/1440)*O42))),0)","v":0},0,null,{"$f":"Data!L57","v":0},{"$f":"Data!M57/Data!N57","v":{"$error":"#N/A"}},null,33,27611.78,{"$f":"4*PI()*E$18/LN(0.56146/(Data!V$23^2*'C&J'!E$15/(4*'C&J'!E$18*'C&J'!X42/1440)))","v":3.8035247758553581},27626.78]
[null,null,null,null,null,null,null,null,null,null,null,null,null,35,{"$f":"IF(Data!L58>=E$9,Data!L58-E$10,0)","v":0},{"$f":"IF(O43>0,P42+7.48*Data!M58*(Data!B58-Data!B57)/1440,0)","v":0},{"$f":"IF(O43>0,Q42+7.48*(4*PI()*(E$16/1440)*Data!N58)*(Data!B58-Data!B57)/LN(0.56146/((Data!P58^2*'C&J'!E$15)/(4*('C&J'!E$16/1440)*O43))),0)","v":0},0,null,{"$f":"Data!L58","v":0},{"$f":"Data!M58/Data!N58","v":{"$error":"#N/A"}},null,34,28448.44,{"$f":"4*PI()*E$18/LN(0.56146/(Data!V$23^2*'C&J'!E$15/(4*'C&J'!E$18*'C&J'!X43/1440)))","v":3.793849722278789},28463.439999999999]
[null,null,null,null,null,null,null,null,null,null,null,null,null,36,{"$f":"IF(Data!L59>=E$9,Data!L59-E$10,0)","v":0},{"$f":"IF(O44>0,P43+7.48*Data!M59*(Data!B59-Data!B58)/1440,0)","v":0},{"$f":"IF(O44>0,Q43+7.48*(4*PI()*(E$16/1440)*Data!N59)*(Data!B59-Data!B58)/LN(0.56146/((Data!P59^2*'C&J'!E$15)/(4*('C&J'!E$16/1440)*O44))),0)","v":0},0,null,{"$f":"Data!L59","v":0},{"$f":"Data!M59/Data!N59","v":{"$error":"#N/A"}},null,35,29285.1,{"$f":"4*PI()*E$18/LN(0.56146/(Data!V$23^2*'C&J'!E$15/(4*'C&J'!E$18*'C&J'!X44/1440)))","v":3.7845021108971872},29300.1]
[null,null,null,null,null,null,null,null,null,null,null,null,null,37,{"$f":"IF(Data!L60>=E$9,Data!L60-E$10,0)","v":0},{"$f":"IF(O45>0,P44+7.48*Data!M60*(Data!B60-Data!B59)/1440,0)","v":0},{"$f":"IF(O45>0,Q44+7.48*(4*PI()*(E$16/1440)*Data!N60)*(Data!B60-Data!B59)/LN(0.56146/((Data!P60^2*'C&J'!E$15)/(4*('C&J'!E$16/1440)*O45))),0)","v":0},0,null,{"$f":"Data!L60","v":0},{"$f":"Data!M60/Data!N60","v":{"$error":"#N/A"}},null,36,30121.759999999998,{"$f":"4*PI()*E$18/LN(0.56146/(Data!V$23^2*'C&J'!E$15/(4*'C&J'!E$18*'C&J'!X45/1440)))","v":3.7754618593992859},30136.76]
[null,null,null,null,null,null,null,null,null,null,null,null,null,38,{"$f":"IF(Data!L61>=E$9,Data!L61-E$10,0)","v":0},{"$f":"IF(O46>0,P45+7.48*Data!M61*(Data!B61-Data!B60)/1440,0)","v":0},{"$f":"IF(O46>0,Q45+7.48*(4*PI()*(E$16/1440)*Data!N61)*(Data!B61-Data!B60)/LN(0.56146/((Data!P61^2*'C&J'!E$15)/(4*('C&J'!E$16/1440)*O46))),0)","v":0},0,null,{"$f":"Data!L61","v":0},{"$f":"Data!M61/Data!N61","v":{"$error":"#N/A"}},null,37,30958.42,{"$f":"4*PI()*E$18/LN(0.56146/(Data!V$23^2*'C&J'!E$15/(4*'C&J'!E$18*'C&J'!X46/1440)))","v":3.7667106362728884},30973.42]
[null,null,null,null,null,null,null,null,null,null,null,null,null,39,{"$f":"IF(Data!L62>=E$9,Data!L62-E$10,0)","v":0},{"$f":"IF(O47>0,P46+7.48*Data!M62*(Data!B62-Data!B61)/1440,0)","v":0},{"$f":"IF(O47>0,Q46+7.48*(4*PI()*(E$16/1440)*Data!N62)*(Data!B62-Data!B61)/LN(0.56146/((Data!P62^2*'C&J'!E$15)/(4*('C&J'!E$16/1440)*O47))),0)","v":0},0,null,{"$f":"Data!L62","v":0},{"$f":"Data!M62/Data!N62","v":{"$error":"#N/A"}},null,38,31795.08,{"$f":"4*PI()*E$18/LN(0.56146/(Data!V$23^2*'C&J'!E$15/(4*'C&J'!E$18*'C&J'!X47/1440)))","v":3.7582316654100492},31810.080000000002]
[null,null,null,null,null,null,null,null,null,null,null,null,null,40,{"$f":"IF(Data!L63>=E$9,Data!L63-E$10,0)","v":0},{"$f":"IF(O48>0,P47+7.48*Data!M63*(Data!B63-Data!B62)/1440,0)","v":0},{"$f":"IF(O48>0,Q47+7.48*(4*PI()*(E$16/1440)*Data!N63)*(Data!B63-Data!B62)/LN(0.56146/((Data!P63^2*'C&J'!E$15)/(4*('C&J'!E$16/1440)*O48))),0)","v":0},0,null,{"$f":"Data!L63","v":0},{"$f":"Data!M63/Data!N63","v":{"$error":"#N/A"}},null,39,32631.74,{"$f":"4*PI()*E$18/LN(0.56146/(Data!V$23^2*'C&J'!E$15/(4*'C&J'!E$18*'C&J'!X48/1440)))","v":3.7500095570380898},32646.74]
[null,null,null,null,null,null,null,null,null,"Height",null,null,null,41,{"$f":"IF(Data!L64>=E$9,Data!L64-E$10,0)","v":0},{"$f":"IF(O49>0,P48+7.48*Data!M64*(Data!B64-Data!B63)/1440,0)","v":0},{"$f":"IF(O49>0,Q48+7.48*(4*PI()*(E$16/1440)*Data!N64)*(Data!B64-Data!B63)/LN(0.56146/((Data!P64^2*'C&J'!E$15)/(4*('C&J'!E$16/1440)*O49))),0)","v":0},0,null,{"$f":"Data!L64","v":0},{"$f":"Data!M64/Data!N64","v":{"$error":"#N/A"}},null,40,33468.400000000001,{"$f":"4*PI()*E$18/LN(0.56146/(Data!V$23^2*'C&J'!E$15/(4*'C&J'!E$18*'C&J'!X49/1440)))","v":3.7420301608518596},33483.4]
[null,null,null,null,null,null,null,null,null,70,null,null,null,42,{"$f":"IF(Data!L65>=E$9,Data!L65-E$10,0)","v":0},{"$f":"IF(O50>0,P49+7.48*Data!M65*(Data!B65-Data!B64)/1440,0)","v":0},{"$f":"IF(O50>0,Q49+7.48*(4*PI()*(E$16/1440)*Data!N65)*(Data!B65-Data!B64)/LN(0.56146/((Data!P65^2*'C&J'!E$15)/(4*('C&J'!E$16/1440)*O50))),0)","v":0},0,null,{"$f":"Data!L65","v":0},{"$f":"Data!M65/Data!N65","v":{"$error":"#N/A"}},null,41,34305.06,{"$f":"4*PI()*E$18/LN(0.56146/(Data!V$23^2*'C&J'!E$15/(4*'C&J'!E$18*'C&J'!X50/1440)))","v":3.7342804379548937},34320.06]
[null,null,null,null,null,null,null,null,null,null,null,null,null,43,{"$f":"IF(Data!L66>=E$9,Data!L66-E$10,0)","v":0},{"$f":"IF(O51>0,P50+7.48*Data!M66*(Data!B66-Data!B65)/1440,0)","v":0},{"$f":"IF(O51>0,Q50+7.48*(4*PI()*(E$16/1440)*Data!N66)*(Data!B66-Data!B65)/LN(0.56146/((Data!P66^2*'C&J'!E$15)/(4*('C&J'!E$16/1440)*O51))),0)","v":0},0,null,{"$f":"Data!L66","v":0},{"$f":"Data!M66/Data!N66","v":{"$error":"#N/A"}},null,42,35141.72,{"$f":"4*PI()*E$18/LN(0.56146/(Data!V$23^2*'C&J'!E$15/(4*'C&J'!E$18*'C&J'!X51/1440)))","v":3.7267483488047941},35156.720000000001]
[null,null,null,null,null,null,null,null,null,null,null,null,null,44,{"$f":"IF(Data!L67>=E$9,Data!L67-E$10,0)","v":0},{"$f":"IF(O52>0,P51+7.48*Data!M67*(Data!B67-Data!B66)/1440,0)","v":0},{"$f":"IF(O52>0,Q51+7.48*(4*PI()*(E$16/1440)*Data!N67)*(Data!B67-Data!B66)/LN(0.56146/((Data!P67^2*'C&J'!E$15)/(4*('C&J'!E$16/1440)*O52))),0)","v":0},0,null,{"$f":"Data!L67","v":0},{"$f":"Data!M67/Data!N67","v":{"$error":"#N/A"}},null,43,35978.379999999997,{"$f":"4*PI()*E$18/LN(0.56146/(Data!V$23^2*'C&J'!E$15/(4*'C&J'!E$18*'C&J'!X52/1440)))","v":3.7194227548326175},35993.379999999997]
[null,null,null,null,null,null,null,null,null,null,null,null,null,45,{"$f":"IF(Data!L68>=E$9,Data!L68-E$10,0)","v":0},{"$f":"IF(O53>0,P52+7.48*Data!M68*(Data!B68-Data!B67)/1440,0)","v":0},{"$f":"IF(O53>0,Q52+7.48*(4*PI()*(E$16/1440)*Data!N68)*(Data!B68-Data!B67)/LN(0.56146/((Data!P68^2*'C&J'!E$15)/(4*('C&J'!E$16/1440)*O53))),0)","v":0},0,null,{"$f":"Data!L68","v":0},{"$f":"Data!M68/Data!N68","v":{"$error":"#N/A"}},null,44,36815.040000000001,{"$f":"4*PI()*E$18/LN(0.56146/(Data!V$23^2*'C&J'!E$15/(4*'C&J'!E$18*'C&J'!X53/1440)))","v":3.7122933317911495},36830.04]
[null,null,null,null,null,null,null,null,null,null,null,null,null,46,{"$f":"IF(Data!L69>=E$9,Data!L69-E$10,0)","v":0},{"$f":"IF(O54>0,P53+7.48*Data!M69*(Data!B69-Data!B68)/1440,0)","v":0},{"$f":"IF(O54>0,Q53+7.48*(4*PI()*(E$16/1440)*Data!N69)*(Data!B69-Data!B68)/LN(0.56146/((Data!P69^2*'C&J'!E$15)/(4*('C&J'!E$16/1440)*O54))),0)","v":0},0,null,{"$f":"Data!L69","v":0},{"$f":"Data!M69/Data!N69","v":{"$error":"#N/A"}},null,45,37651.699999999997,{"$f":"4*PI()*E$18/LN(0.56146/(Data!V$23^2*'C&J'!E$15/(4*'C&J'!E$18*'C&J'!X54/1440)))","v":3.7053504932011991},37666.699999999997]
[null,null,null,null,null,null,null,null,null,null,null,null,null,47,{"$f":"IF(Data!L70>=E$9,Data!L70-E$10,0)","v":0},{"$f":"IF(O55>0,P54+7.48*Data!M70*(Data!B70-Data!B69)/1440,0)","v":0},{"$f":"IF(O55>0,Q54+7.48*(4*PI()*(E$16/1440)*Data!N70)*(Data!B70-Data!B69)/LN(0.56146/((Data!P70^2*'C&J'!E$15)/(4*('C&J'!E$16/1440)*O55))),0)","v":0},0,null,{"$f":"Data!L70","v":0},{"$f":"Data!M70/Data!N70","v":{"$error":"#N/A"}},null,46,38488.36,{"$f":"4*PI()*E$18/LN(0.56146/(Data!V$23^2*'C&J'!E$15/(4*'C&J'!E$18*'C&J'!X55/1440)))","v":3.6985853225226979},38503.360000000001]
[null,null,null,null,null,null,null,null,null,null,null,null,null,48,{"$f":"IF(Data!L71>=E$9,Data!L71-E$10,0)","v":0},{"$f":"IF(O56>0,P55+7.48*Data!M71*(Data!B71-Data!B70)/1440,0)","v":0},{"$f":"IF(O56>0,Q55+7.48*(4*PI()*(E$16/1440)*Data!N71)*(Data!B71-Data!B70)/LN(0.56146/((Data!P71^2*'C&J'!E$15)/(4*('C&J'!E$16/1440)*O56))),0)","v":0},0,null,{"$f":"Data!L71","v":0},{"$f":"Data!M71/Data!N71","v":{"$error":"#N/A"}},null,47,39325.019999999997,{"$f":"4*PI()*E$18/LN(0.56146/(Data!V$23^2*'C&J'!E$15/(4*'C&J'!E$18*'C&J'!X56/1440)))","v":3.6919895128896991},39340.019999999997]
[null,null,null,null,null,null,null,null,null,null,null,null,null,49,{"$f":"IF(Data!L72>=E$9,Data!L72-E$10,0)","v":0},{"$f":"IF(O57>0,P56+7.48*Data!M72*(Data!B72-Data!B71)/1440,0)","v":0},{"$f":"IF(O57>0,Q56+7.48*(4*PI()*(E$16/1440)*Data!N72)*(Data!B72-Data!B71)/LN(0.56146/((Data!P72^2*'C&J'!E$15)/(4*('C&J'!E$16/1440)*O57))),0)","v":0},0,null,{"$f":"Data!L72","v":0},{"$f":"Data!M72/Data!N72","v":{"$error":"#N/A"}},null,48,40161.68,{"$f":"4*PI()*E$18/LN(0.56146/(Data!V$23^2*'C&J'!E$15/(4*'C&J'!E$18*'C&J'!X57/1440)))","v":3.6855553134240364},40176.68]
[null,null,null,null,null,null,null,null,null,null,null,null,null,50,{"$f":"IF(Data!L73>=E$9,Data!L73-E$10,0)","v":0},{"$f":"IF(O58>0,P57+7.48*Data!M73*(Data!B73-Data!B72)/1440,0)","v":0},{"$f":"IF(O58>0,Q57+7.48*(4*PI()*(E$16/1440)*Data!N73)*(Data!B73-Data!B72)/LN(0.56146/((Data!P73^2*'C&J'!E$15)/(4*('C&J'!E$16/1440)*O58))),0)","v":0},0,null,{"$f":"Data!L73","v":0},{"$f":"Data!M73/Data!N73","v":{"$error":"#N/A"}},null,49,40998.339999999997,{"$f":"4*PI()*E$18/LN(0.56146/(Data!V$23^2*'C&J'!E$15/(4*'C&J'!E$18*'C&J'!X58/1440)))","v":3.6792754812884598},41013.339999999997]
[null,null,null,null,null,null,null,null,null,null,null,null,null,null,null,null,null,null,null,{"$f":"Data!L74","v":0},{"$f":"Data!M74/Data!N74","v":{"$error":"#N/A"}},null,50,41835,{"$f":"4*PI()*E$18/LN(0.56146/(Data!V$23^2*'C&J'!E$15/(4*'C&J'!E$18*'C&J'!X59/1440)))","v":3.6731432387618828},41850]
[null,null,null,null,null,null,null,null,null,null,null,null,null,null,null,null,null,null,null,{"$f":"Data!L75","v":0},{"$f":"Data!M75/Data!N75","v":{"$error":"#N/A"}}]
[null,null,null,null,null,null,null,null,null,null,null,null,null,null,null,null,null,null,null,{"$f":"Data!L76","v":0},{"$f":"Data!M76/Data!N76","v":{"$error":"#N/A"}}]
[null,null,null,null,null,null,null,null,null,null,null,null,null,null,null,null,null,null,null,{"$f":"Data!L77","v":0},{"$f":"Data!M77/Data!N77","v":{"$error":"#N/A"}}]
[null,null,null,null,null,null,null,null,null,null,null,null,null,null,null,null,null,null,null,{"$f":"Data!L78","v":0},{"$f":"Data!M78/Data!N78","v":{"$error":"#N/A"}}]
[null,null,null,null,null,null,null,null,null,null,null,null,null,null,null,null,null,null,null,{"$f":"Data!L79","v":0},{"$f":"Data!M79/Data!N79","v":{"$error":"#N/A"}}]
[null,null,null,null,null,null,null,null,null,null,null,null,null,null,null,null,null,null,null,{"$f":"Data!L80","v":0},{"$f":"Data!M80/Data!N80","v":{"$error":"#N/A"}}]
[null,null,null,null,null,null,null,null,null,null,null,null,null,null,null,null,null,null,null,{"$f":"Data!L81","v":0},{"$f":"Data!M81/Data!N81","v":{"$error":"#N/A"}}]

{"sheet":"CB&P","index":5,"n_rows":108,"n_cols":25,"rows_kept":108,"cut":false,"hidden":false,"merged":[]}
["Cooper, Bredehoeft and Papadopulos (1967)"]
["Well Designation:",null,{"$f":"IF(Data!B1 > 0,Data!B1,\"\")","v":"YYY"},null,null,null,null,null,null,null,null,null,null,null,null,"e",9.9999999999999995E-7]
["Date:",null,{"$f":"IF(Data!B2 > 0,Data!B2,\"\")","v":"date"}]
[]
[null,"Enter early time cut-off for least-squares model fit"]
[null,null,"Timecut (min):",null,25,"<-  Enter or change values here",null,null,null,null,null,null,null,"Count","Time ","H/Ho","G (a,b,e)","SE",null,null,null,null,null,"Time ","H/Ho"]
[null,"Initial Drawdown sn (ft):",null,null,0.25,null,null,null,null,null,null,null,null,null,"(min)",null,null,null,null,"Index","Time (min)","G( )",null,"(min)"]
[null,null,null,null,null,null,null,null,null,null,null,null,null,{"$f":"IF(O8>0,1,0)","v":0},{"$f":"IF(Data!B23>E$6,Data!B23-E$6,0)","v":0},{"$f":"IF(N8>0,Data!J23/'CB&P'!E$7,0)","v":0},{"$f":"IF(N8>0,G(E$14,((-J$20)*'CB&P'!E$13/1440)*'CB&P'!O8/Data!V$23^2,'CB&P'!Q$2),0)","v":0},{"$f":"N8*(P8-Q8)^2","v":0},null,0,{"$f":"EXP(LN(J$15)+(LN(J$16)-LN(J$15))*T8/100)","v":3.0000000000000004},{"$f":"G('CB&P'!E$14,((-J$20)*'CB&P'!E$13/1440)*'CB&P'!U8/Data!V$23^2,0.00001)","v":0.65384757913400948},null,{"$f":"IF(N8>0,O8,NA())","v":{"$error":"#N/A"}},{"$f":"IF(N8>0,P8,NA())","v":{"$error":"#N/A"}}]
[null,"Trial Sn:",null,null,"d","<-- Enter d for default",null,null,null,null,null,null,null,{"$f":"IF(O9>0,1,0)","v":0},{"$f":"IF(Data!B24>E$6,Data!B24-E$6,0)","v":0},{"$f":"IF(N9>0,Data!J24/'CB&P'!E$7,0)","v":0},{"$f":"IF(N9>0,G(E$14,((-J$20)*'CB&P'!E$13/1440)*'CB&P'!O9/Data!V$23^2,'CB&P'!Q$2),0)","v":0},{"$f":"N9*(P9-Q9)^2","v":0},null,1,3.1330499620379677,{"$f":"G('CB&P'!E$14,((-J$20)*'CB&P'!E$13/1440)*'CB&P'!U9/Data!V$23^2,0.00001)","v":0.64580820462727218},null,{"$f":"IF(N9>0,O9,NA())","v":{"$error":"#N/A"}},{"$f":"IF(N9>0,P9,NA())","v":{"$error":"#N/A"}}]
[null,null,null,null,null,null,null,null,null,null,null,null,null,0,{"$f":"IF(Data!B25>E$6,Data!B25-E$6,0)","v":0},{"$f":"IF(N10>0,Data!J25/'CB&P'!E$7,0)","v":0},{"$f":"IF(N10>0,G(E$14,((-J$20)*'CB&P'!E$13/1440)*'CB&P'!O10/Data!V$23^2,'CB&P'!Q$2),0)","v":0},0,null,2,3.2720006882087023,{"$f":"G('CB&P'!E$14,((-J$20)*'CB&P'!E$13/1440)*'CB&P'!U10/Data!V$23^2,0.00001)","v":0.63763186847032793},null,{"$error":"#N/A"},{"$error":"#N/A"}]
[null,"Root-Mean-Square Error:",null,null,{"$f":"SQRT(SUM(R8:R48))","v":21.488228285182881},"<-- Minimize this using \"Solver\"",null,null,null,null,null,null,null,0,{"$f":"IF(Data!B26>E$6,Data!B26-E$6,0)","v":0},{"$f":"IF(N11>0,Data!J26/'CB&P'!E$7,0)","v":0},{"$f":"IF(N11>0,G(E$14,((-J$20)*'CB&P'!E$13/1440)*'CB&P'!O11/Data!V$23^2,'CB&P'!Q$2),0)","v":0},0,null,3,3.4171138773268255,{"$f":"G('CB&P'!E$14,((-J$20)*'CB&P'!E$13/1440)*'CB&P'!U11/Data!V$23^2,0.00001)","v":0.62931973486217263},null,{"$error":"#N/A"},{"$error":"#N/A"}]
[null,null,null,null,null,null,null,null,null,null,null,null,null,0,{"$f":"IF(Data!B27>E$6,Data!B27-E$6,0)","v":0},{"$f":"IF(N12>0,Data!J27/'CB&P'!E$7,0)","v":0},{"$f":"IF(N12>0,G(E$14,((-J$20)*'CB&P'!E$13/1440)*'CB&P'!O12/Data!V$23^2,'CB&P'!Q$2),0)","v":0},0,null,4,3.5686628345460734,{"$f":"G('CB&P'!E$14,((-J$20)*'CB&P'!E$13/1440)*'CB&P'!U12/Data!V$23^2,0.00001)","v":0.6208731680967593},null,{"$error":"#N/A"},{"$error":"#N/A"}]
[null,"Trial Tn (ft2/d):",null,null,2.6421999533064855,"<-- By changing Tn through \"Solver\"",null,null,null,null,null,null,null,0,{"$f":"IF(Data!B28>E$6,Data!B28-E$6,0)","v":0},{"$f":"IF(N13>0,Data!J28/'CB&P'!E$7,0)","v":0},{"$f":"IF(N13>0,G(E$14,((-J$20)*'CB&P'!E$13/1440)*'CB&P'!O13/Data!V$23^2,'CB&P'!Q$2),0)","v":0},0,null,5,3.7269329861002931,{"$f":"G('CB&P'!E$14,((-J$20)*'CB&P'!E$13/1440)*'CB&P'!U13/Data!V$23^2,0.00001)","v":0.61229382821142864},null,{"$error":"#N/A"},{"$error":"#N/A"}]
[null,null,null,null,{"$f":"IF(E9=\"d\",0.025*SQRT(E13),E9)","v":4.063711321952574E-2},"<-- Working Sn",null,"Add constraint Tn > 0.00001",null,null,null,null,null,0,{"$f":"IF(Data!B29>E$6,Data!B29-E$6,0)","v":0},{"$f":"IF(N14>0,Data!J29/'CB&P'!E$7,0)","v":0},{"$f":"IF(N14>0,G(E$14,((-J$20)*'CB&P'!E$13/1440)*'CB&P'!O14/Data!V$23^2,'CB&P'!Q$2),0)","v":0},0,null,6,3.8922224168731896,{"$f":"G('CB&P'!E$14,((-J$20)*'CB&P'!E$13/1440)*'CB&P'!U14/Data!V$23^2,0.00001)","v":0.60358365763517374},null,{"$error":"#N/A"},{"$error":"#N/A"}]
[null,"Model Result:",null,"Tn (ft2/d) =",{"$f":"E13","v":2.6421999533064855},null,null,null,"Tmin",3,null,null,null,0,{"$f":"IF(Data!B30>E$6,Data!B30-E$6,0)","v":0},{"$f":"IF(N15>0,Data!J30/'CB&P'!E$7,0)","v":0},{"$f":"IF(N15>0,G(E$14,((-J$20)*'CB&P'!E$13/1440)*'CB&P'!O15/Data!V$23^2,'CB&P'!Q$2),0)","v":0},0,null,7,4.0648424318092902,{"$f":"G('CB&P'!E$14,((-J$20)*'CB&P'!E$13/1440)*'CB&P'!U15/Data!V$23^2,0.00001)","v":0.59474489264915709},null,{"$error":"#N/A"},{"$error":"#N/A"}]
[null,null,null,null,null,null,null,null,"Tmax",230,null,null,null,0,{"$f":"IF(Data!B31>E$6,Data!B31-E$6,0)","v":0},{"$f":"IF(N16>0,Data!J31/'CB&P'!E$7,0)","v":0},{"$f":"IF(N16>0,G(E$14,((-J$20)*'CB&P'!E$13/1440)*'CB&P'!O16/Data!V$23^2,'CB&P'!Q$2),0)","v":0},0,null,8,4.2451181422234718,{"$f":"G('CB&P'!E$14,((-J$20)*'CB&P'!E$13/1440)*'CB&P'!U16/Data!V$23^2,0.00001)","v":0.58578007445592706},null,{"$error":"#N/A"},{"$error":"#N/A"}]
[null,null,null,null,null,null,null,null,null,null,null,null,null,0,{"$f":"IF(Data!B32>E$6,Data!B32-E$6,0)","v":0},{"$f":"IF(N17>0,Data!J32/'CB&P'!E$7,0)","v":0},{"$f":"IF(N17>0,G(E$14,((-J$20)*'CB&P'!E$13/1440)*'CB&P'!O17/Data!V$23^2,'CB&P'!Q$2),0)","v":0},0,null,9,4.4333890781133114,{"$f":"G('CB&P'!E$14,((-J$20)*'CB&P'!E$13/1440)*'CB&P'!U17/Data!V$23^2,0.00001)","v":0.57669205977577143},null,{"$error":"#N/A"},{"$error":"#N/A"}]
[null,null,null,null,null,null,null,null,null,null,null,null,null,0,{"$f":"IF(Data!B33>E$6,Data!B33-E$6,0)","v":0},{"$f":"IF(N18>0,Data!J33/'CB&P'!E$7,0)","v":0},{"$f":"IF(N18>0,G(E$14,((-J$20)*'CB&P'!E$13/1440)*'CB&P'!O18/Data!V$23^2,'CB&P'!Q$2),0)","v":0},0,null,10,4.6300098276274824,{"$f":"G('CB&P'!E$14,((-J$20)*'CB&P'!E$13/1440)*'CB&P'!U18/Data!V$23^2,0.00001)","v":0.5674840308800706},null,{"$error":"#N/A"},{"$error":"#N/A"}]
[null,null,null,null,null,null,null,null,null,"J-Ratio",null,null,null,1,{"$f":"IF(Data!B34>E$6,Data!B34-E$6,0)","v":1},{"$f":"IF(N19>0,Data!J34/'CB&P'!E$7,0)","v":6.1200000000000045},{"$f":"IF(N19>0,G(E$14,((-J$20)*'CB&P'!E$13/1440)*'CB&P'!O19/Data!V$23^2,'CB&P'!Q$2),0)","v":0.81245763806918836},28.170005923690141,null,11,4.835350704894565,{"$f":"G('CB&P'!E$14,((-J$20)*'CB&P'!E$13/1440)*'CB&P'!U19/Data!V$23^2,0.00001)","v":0.55815950496333566},null,1,6.1200000000000045]
[null,null,null,null,null,null,null,null,null,{"$f":"Figures!U27","v":-1.2765957446808507},null,null,null,1,{"$f":"IF(Data!B35>E$6,Data!B35-E$6,0)","v":5},{"$f":"IF(N20>0,Data!J35/'CB&P'!E$7,0)","v":6.0800000000000125},{"$f":"IF(N20>0,G(E$14,((-J$20)*'CB&P'!E$13/1440)*'CB&P'!O20/Data!V$23^2,'CB&P'!Q$2),0)","v":0.55088730065451608},30.571087242063644,null,12,5.0497984474700583,{"$f":"G('CB&P'!E$14,((-J$20)*'CB&P'!E$13/1440)*'CB&P'!U20/Data!V$23^2,0.00001)","v":0.54872234274800236},null,5,6.0800000000000125]
[null,null,null,null,null,null,null,null,null,null,null,null,null,1,{"$f":"IF(Data!B36>E$6,Data!B36-E$6,0)","v":15},{"$f":"IF(N21>0,Data!J36/'CB&P'!E$7,0)","v":5.9199999999999875},{"$f":"IF(N21>0,G(E$14,((-J$20)*'CB&P'!E$13/1440)*'CB&P'!O21/Data!V$23^2,'CB&P'!Q$2),0)","v":0.29387904204315374},31.653237033561126,null,13,5.2737569447151511,{"$f":"G('CB&P'!E$14,((-J$20)*'CB&P'!E$13/1440)*'CB&P'!U21/Data!V$23^2,0.00001)","v":0.53917675620913286},null,15,5.9199999999999875]
[null,null,null,null,null,null,null,null,null,null,null,null,null,1,{"$f":"IF(Data!B37>E$6,Data!B37-E$6,0)","v":25},{"$f":"IF(N22>0,Data!J37/'CB&P'!E$7,0)","v":5.8000000000000114},{"$f":"IF(N22>0,G(E$14,((-J$20)*'CB&P'!E$13/1440)*'CB&P'!O22/Data!V$23^2,'CB&P'!Q$2),0)","v":0.18677678161385713},31.508274899429413,null,14,5.50764799847909,{"$f":"G('CB&P'!E$14,((-J$20)*'CB&P'!E$13/1440)*'CB&P'!U22/Data!V$23^2,0.00001)","v":0.52952731530002917},null,25,5.8000000000000114]
[null,null,null,null,null,null,null,null,null,null,null,null,null,1,{"$f":"IF(Data!B38>E$6,Data!B38-E$6,0)","v":35},{"$f":"IF(N23>0,Data!J38/'CB&P'!E$7,0)","v":5.6800000000000068},{"$f":"IF(N23>0,G(E$14,((-J$20)*'CB&P'!E$13/1440)*'CB&P'!O23/Data!V$23^2,'CB&P'!Q$2),0)","v":0.13067250583766393},30.795035637466107,null,15,5.7519121175177981,{"$f":"G('CB&P'!E$14,((-J$20)*'CB&P'!E$13/1440)*'CB&P'!U23/Data!V$23^2,0.00001)","v":0.51977895355452863},null,35,5.6800000000000068]
[null,null,null,null,null,null,null,null,null,null,null,null,null,1,{"$f":"IF(Data!B39>E$6,Data!B39-E$6,0)","v":45},{"$f":"IF(N24>0,Data!J39/'CB&P'!E$7,0)","v":5.5999999999999943},{"$f":"IF(N24>0,G(E$14,((-J$20)*'CB&P'!E$13/1440)*'CB&P'!O24/Data!V$23^2,'CB&P'!Q$2),0)","v":9.7603023239678371E-2},30.276372489861068,null,16,6.0070093471449519,{"$f":"G('CB&P'!E$14,((-J$20)*'CB&P'!E$13/1440)*'CB&P'!U24/Data!V$23^2,0.00001)","v":0.5099369724374464},null,45,5.5999999999999943]
[null,null,null,null,null,null,null,null,null,null,null,null,null,1,{"$f":"IF(Data!B40>E$6,Data!B40-E$6,0)","v":55},{"$f":"IF(N25>0,Data!J40/'CB&P'!E$7,0)","v":5.5200000000000102},{"$f":"IF(N25>0,G(E$14,((-J$20)*'CB&P'!E$13/1440)*'CB&P'!O25/Data!V$23^2,'CB&P'!Q$2),0)","v":7.6484406051243889E-2},29.631862021563389,null,17,6.2734201356780694,{"$f":"G('CB&P'!E$14,((-J$20)*'CB&P'!E$13/1440)*'CB&P'!U25/Data!V$23^2,0.00001)","v":0.50000704431142007},null,55,5.5200000000000102]
[null,null,null,null,null,null,null,null,null,null,null,null,null,1,{"$f":"IF(Data!B41>E$6,Data!B41-E$6,0)","v":65},{"$f":"IF(N26>0,Data!J41/'CB&P'!E$7,0)","v":5.4799999999999898},{"$f":"IF(N26>0,G(E$14,((-J$20)*'CB&P'!E$13/1440)*'CB&P'!O26/Data!V$23^2,'CB&P'!Q$2),0)","v":6.2160802469616139E-2},29.35298157029656,null,18,6.5516462393114647,{"$f":"G('CB&P'!E$14,((-J$20)*'CB&P'!E$13/1440)*'CB&P'!U26/Data!V$23^2,0.00001)","v":0.4899952138863643},null,65,5.4799999999999898]
[null,null,null,null,null,null,null,null,null,null,null,null,null,1,{"$f":"IF(Data!B42>E$6,Data!B42-E$6,0)","v":75},{"$f":"IF(N27>0,Data!J42/'CB&P'!E$7,0)","v":5.4399999999999977},{"$f":"IF(N27>0,G(E$14,((-J$20)*'CB&P'!E$13/1440)*'CB&P'!O27/Data!V$23^2,'CB&P'!Q$2),0)","v":5.1973251784595227E-2},{"$f":"N27*(P27-Q27)^2","v":29.030832239484646},null,19,6.842211667120325,{"$f":"G('CB&P'!E$14,((-J$20)*'CB&P'!E$13/1440)*'CB&P'!U27/Data!V$23^2,0.00001)","v":0.47990789801696881},null,75,5.4399999999999977]
[null,null,null,null,null,null,null,null,null,null,null,null,null,1,{"$f":"IF(Data!B43>E$6,Data!B43-E$6,0)","v":975},{"$f":"IF(N28>0,Data!J43/'CB&P'!E$7,0)","v":5.4799999999999898},{"$f":"IF(N28>0,G(E$14,((-J$20)*'CB&P'!E$13/1440)*'CB&P'!O28/Data!V$23^2,'CB&P'!Q$2),0)","v":2.8701570581247731E-3},{"$f":"N28*(P28-Q28)^2","v":29.998951316444384},null,20,7.1456636679756889,{"$f":"G('CB&P'!E$14,((-J$20)*'CB&P'!E$13/1440)*'CB&P'!U28/Data!V$23^2,0.00001)","v":0.46975188371436277},null,975,5.4799999999999898]
[null,null,null,null,null,null,null,null,null,null,null,null,null,1,{"$f":"IF(Data!B44>E$6,Data!B44-E$6,0)","v":2425},{"$f":"IF(N29>0,Data!J44/'CB&P'!E$7,0)","v":5.9199999999999875},{"$f":"IF(N29>0,G(E$14,((-J$20)*'CB&P'!E$13/1440)*'CB&P'!O29/Data!V$23^2,'CB&P'!Q$2),0)","v":1.1281557241579836E-3},35.033043908961162,null,21,7.4625737612291028,{"$f":"G('CB&P'!E$14,((-J$20)*'CB&P'!E$13/1440)*'CB&P'!U29/Data!V$23^2,0.00001)","v":0.45953432424027996},null,2425,5.9199999999999875]
[null,null,null,null,null,null,null,null,null,null,null,null,null,1,{"$f":"IF(Data!B45>E$6,Data!B45-E$6,0)","v":3875},{"$f":"IF(N30>0,Data!J45/'CB&P'!E$7,0)","v":6},{"$f":"IF(N30>0,G(E$14,((-J$20)*'CB&P'!E$13/1440)*'CB&P'!O30/Data!V$23^2,'CB&P'!Q$2),0)","v":7.0165270068153632E-4},35.991580659908337,null,22,7.7935388131081238,{"$f":"G('CB&P'!E$14,((-J$20)*'CB&P'!E$13/1440)*'CB&P'!U30/Data!V$23^2,0.00001)","v":0.44926273315605725},null,3875,6]
[null,null,null,null,null,null,null,null,null,null,null,null,null,1,{"$f":"IF(Data!B46>E$6,Data!B46-E$6,0)","v":5325},{"$f":"IF(N31>0,Data!J46/'CB&P'!E$7,0)","v":5.2400000000000091},{"$f":"IF(N31>0,G(E$14,((-J$20)*'CB&P'!E$13/1440)*'CB&P'!O31/Data!V$23^2,'CB&P'!Q$2),0)","v":5.0908955892559429E-4},27.452265000594732,null,23,8.1391821608499431,{"$f":"G('CB&P'!E$14,((-J$20)*'CB&P'!E$13/1440)*'CB&P'!U31/Data!V$23^2,0.00001)","v":0.43894497620460871},null,5325,5.2400000000000091]
[null,null,null,null,null,null,null,null,null,null,null,null,null,1,{"$f":"IF(Data!B47>E$6,Data!B47-E$6,0)","v":29215},{"$f":"IF(N32>0,Data!J47/'CB&P'!E$7,0)","v":5.5200000000000102},{"$f":"IF(N32>0,G(E$14,((-J$20)*'CB&P'!E$13/1440)*'CB&P'!O32/Data!V$23^2,'CB&P'!Q$2),0)","v":9.2142071931443644E-5},30.469382760016149,null,24,8.5001547866903344,{"$f":"G('CB&P'!E$14,((-J$20)*'CB&P'!E$13/1440)*'CB&P'!U32/Data!V$23^2,0.00001)","v":0.42858926091142624},null,29215,5.5200000000000102]
[null,null,null,null,null,null,null,null,null,null,null,null,null,1,{"$f":"IF(Data!B48>E$6,Data!B48-E$6,0)","v":54385},{"$f":"IF(N33>0,Data!J48/'CB&P'!E$7,0)","v":5.6399999999999864},{"$f":"IF(N33>0,G(E$14,((-J$20)*'CB&P'!E$13/1440)*'CB&P'!O33/Data!V$23^2,'CB&P'!Q$2),0)","v":4.9456529526002062E-5},31.809042132792744,null,25,8.8771365439190042,{"$f":"G('CB&P'!E$14,((-J$20)*'CB&P'!E$13/1440)*'CB&P'!U33/Data!V$23^2,0.00001)","v":0.41820412380068739},null,54385,5.6399999999999864]
[null,null,null,null,null,null,null,null,null,null,null,null,null,0,{"$f":"IF(Data!B49>E$6,Data!B49-E$6,0)","v":0},{"$f":"IF(N34>0,Data!J49/'CB&P'!E$7,0)","v":0},{"$f":"IF(N34>0,G(E$14,((-J$20)*'CB&P'!E$13/1440)*'CB&P'!O34/Data!V$23^2,'CB&P'!Q$2),0)","v":0},0,null,26,9.2708374373104245,{"$f":"G('CB&P'!E$14,((-J$20)*'CB&P'!E$13/1440)*'CB&P'!U34/Data!V$23^2,0.00001)","v":0.40779841513493081},null,{"$error":"#N/A"},{"$error":"#N/A"}]
[null,null,null,null,null,null,null,null,null,null,null,null,null,0,{"$f":"IF(Data!B50>E$6,Data!B50-E$6,0)","v":0},{"$f":"IF(N35>0,Data!J50/'CB&P'!E$7,0)","v":0},{"$f":"IF(N35>0,G(E$14,((-J$20)*'CB&P'!E$13/1440)*'CB&P'!O35/Data!V$23^2,'CB&P'!Q$2),0)","v":0},0,null,27,9.681998960341863,{"$f":"G('CB&P'!E$14,((-J$20)*'CB&P'!E$13/1440)*'CB&P'!U35/Data!V$23^2,0.00001)","v":0.39738128110151766},null,{"$error":"#N/A"},{"$error":"#N/A"}]
[null,null,null,null,null,null,null,null,null,null,null,null,null,0,{"$f":"IF(Data!B51>E$6,Data!B51-E$6,0)","v":0},{"$f":"IF(N36>0,Data!J51/'CB&P'!E$7,0)","v":0},{"$f":"IF(N36>0,G(E$14,((-J$20)*'CB&P'!E$13/1440)*'CB&P'!O36/Data!V$23^2,'CB&P'!Q$2),0)","v":0},0,null,28,10.111395491716904,{"$f":"G('CB&P'!E$14,((-J$20)*'CB&P'!E$13/1440)*'CB&P'!U36/Data!V$23^2,0.00001)","v":0.38696214338640317},null,{"$error":"#N/A"},{"$error":"#N/A"}]
[null,null,null,null,null,null,null,null,null,null,null,null,null,0,{"$f":"IF(Data!B52>E$6,Data!B52-E$6,0)","v":0},{"$f":"IF(N37>0,Data!J52/'CB&P'!E$7,0)","v":0},{"$f":"IF(N37>0,G(E$14,((-J$20)*'CB&P'!E$13/1440)*'CB&P'!O37/Data!V$23^2,'CB&P'!Q$2),0)","v":0},0,null,29,10.559835753824835,{"$f":"G('CB&P'!E$14,((-J$20)*'CB&P'!E$13/1440)*'CB&P'!U37/Data!V$23^2,0.00001)","v":0.37655067609555165},null,{"$error":"#N/A"},{"$error":"#N/A"}]
[null,null,null,null,null,null,null,null,null,null,null,null,null,0,{"$f":"IF(Data!B53>E$6,Data!B53-E$6,0)","v":0},{"$f":"IF(N38>0,Data!J53/'CB&P'!E$7,0)","v":0},{"$f":"IF(N38>0,G(E$14,((-J$20)*'CB&P'!E$13/1440)*'CB&P'!O38/Data!V$23^2,'CB&P'!Q$2),0)","v":0},0,null,30,11.028164335882694,{"$f":"G('CB&P'!E$14,((-J$20)*'CB&P'!E$13/1440)*'CB&P'!U38/Data!V$23^2,0.00001)","v":0.36615678000674817},null,{"$error":"#N/A"},{"$error":"#N/A"}]
[null,null,null,null,null,null,null,null,null,null,null,null,null,0,{"$f":"IF(Data!B54>E$6,Data!B54-E$6,0)","v":0},{"$f":"IF(N39>0,Data!J54/'CB&P'!E$7,0)","v":0},{"$f":"IF(N39>0,G(E$14,((-J$20)*'CB&P'!E$13/1440)*'CB&P'!O39/Data!V$23^2,'CB&P'!Q$2),0)","v":0},0,null,31,11.517263284628575,{"$f":"G('CB&P'!E$14,((-J$20)*'CB&P'!E$13/1440)*'CB&P'!U39/Data!V$23^2,0.00001)","v":0.35579055415950539},null,{"$error":"#N/A"},{"$error":"#N/A"}]
[null,null,null,null,null,null,null,null,null,null,null,null,null,0,{"$f":"IF(Data!B55>E$6,Data!B55-E$6,0)","v":0},{"$f":"IF(N40>0,Data!J55/'CB&P'!E$7,0)","v":0},{"$f":"IF(N40>0,G(E$14,((-J$20)*'CB&P'!E$13/1440)*'CB&P'!O40/Data!V$23^2,'CB&P'!Q$2),0)","v":0},0,null,32,{"$f":"EXP(LN(J$15)+(LN(J$16)-LN(J$15))*T40/100)","v":12.028053765562277},{"$f":"G('CB&P'!E$14,((-J$20)*'CB&P'!E$13/1440)*'CB&P'!U40/Data!V$23^2,0.00001)","v":0.34546226481814901},null,{"$error":"#N/A"},{"$error":"#N/A"}]
[null,null,null,null,null,null,null,null,null,null,null,null,null,0,{"$f":"IF(Data!B56>E$6,Data!B56-E$6,0)","v":0},{"$f":"IF(N41>0,Data!J56/'CB&P'!E$7,0)","v":0},{"$f":"IF(N41>0,G(E$14,((-J$20)*'CB&P'!E$13/1440)*'CB&P'!O41/Data!V$23^2,'CB&P'!Q$2),0)","v":0},0,null,33,12.56149779786184,{"$f":"G('CB&P'!E$14,((-J$20)*'CB&P'!E$13/1440)*'CB&P'!U41/Data!V$23^2,0.00001)","v":0.33518231187292419},null,{"$error":"#N/A"},{"$error":"#N/A"}]
[null,null,null,null,null,null,null,null,null,null,null,null,null,0,{"$f":"IF(Data!B57>E$6,Data!B57-E$6,0)","v":0},{"$f":"IF(N42>0,Data!J57/'CB&P'!E$7,0)","v":0},{"$f":"IF(N42>0,G(E$14,((-J$20)*'CB&P'!E$13/1440)*'CB&P'!O42/Data!V$23^2,'CB&P'!Q$2),0)","v":0},0,null,34,13.118600066243676,{"$f":"G('CB&P'!E$14,((-J$20)*'CB&P'!E$13/1440)*'CB&P'!U42/Data!V$23^2,0.00001)","v":0.32496119277578323},null,{"$error":"#N/A"},{"$error":"#N/A"}]
[null,null,null,null,null,null,null,null,null,null,null,null,null,0,{"$f":"IF(Data!B58>E$6,Data!B58-E$6,0)","v":0},{"$f":"IF(N43>0,Data!J58/'CB&P'!E$7,0)","v":0},{"$f":"IF(N43>0,G(E$14,((-J$20)*'CB&P'!E$13/1440)*'CB&P'!O43/Data!V$23^2,'CB&P'!Q$2),0)","v":0},0,null,35,13.700409813178682,{"$f":"G('CB&P'!E$14,((-J$20)*'CB&P'!E$13/1440)*'CB&P'!U43/Data!V$23^2,0.00001)","v":0.31480946414123501},null,{"$error":"#N/A"},{"$error":"#N/A"}]
[null,null,null,null,null,null,null,null,null,null,null,null,null,0,{"$f":"IF(Data!B59>E$6,Data!B59-E$6,0)","v":0},{"$f":"IF(N44>0,Data!J59/'CB&P'!E$7,0)","v":0},{"$f":"IF(N44>0,G(E$14,((-J$20)*'CB&P'!E$13/1440)*'CB&P'!O44/Data!V$23^2,'CB&P'!Q$2),0)","v":0},0,null,36,14.308022815028014,{"$f":"G('CB&P'!E$14,((-J$20)*'CB&P'!E$13/1440)*'CB&P'!U44/Data!V$23^2,0.00001)","v":0.30473770117787191},null,{"$error":"#N/A"},{"$error":"#N/A"}]
[null,null,null,null,null,null,null,null,null,null,null,null,null,0,{"$f":"IF(Data!B60>E$6,Data!B60-E$6,0)","v":0},{"$f":"IF(N45>0,Data!J60/'CB&P'!E$7,0)","v":0},{"$f":"IF(N45>0,G(E$14,((-J$20)*'CB&P'!E$13/1440)*'CB&P'!O45/Data!V$23^2,'CB&P'!Q$2),0)","v":0},0,null,37,14.942583445820629,{"$f":"G('CB&P'!E$14,((-J$20)*'CB&P'!E$13/1440)*'CB&P'!U45/Data!V$23^2,0.00001)","v":0.29475644932406403},null,{"$error":"#N/A"},{"$error":"#N/A"}]
[null,null,null,null,null,null,null,null,null,null,null,null,null,0,{"$f":"IF(Data!B61>E$6,Data!B61-E$6,0)","v":0},{"$f":"IF(N46>0,Data!J61/'CB&P'!E$7,0)","v":0},{"$f":"IF(N46>0,G(E$14,((-J$20)*'CB&P'!E$13/1440)*'CB&P'!O46/Data!V$23^2,'CB&P'!Q$2),0)","v":0},0,null,38,15.605286832559161,{"$f":"G('CB&P'!E$14,((-J$20)*'CB&P'!E$13/1440)*'CB&P'!U46/Data!V$23^2,0.00001)","v":0.28487620602727765},null,{"$error":"#N/A"},{"$error":"#N/A"}]
[null,null,null,null,null,null,null,null,null,null,null,null,null,0,{"$f":"IF(Data!B62>E$6,Data!B62-E$6,0)","v":0},{"$f":"IF(N47>0,Data!J62/'CB&P'!E$7,0)","v":0},{"$f":"IF(N47>0,G(E$14,((-J$20)*'CB&P'!E$13/1440)*'CB&P'!O47/Data!V$23^2,'CB&P'!Q$2),0)","v":0},0,null,39,16.297381106113683,{"$f":"G('CB&P'!E$14,((-J$20)*'CB&P'!E$13/1440)*'CB&P'!U47/Data!V$23^2,0.00001)","v":0.27510733063099674},null,{"$error":"#N/A"},{"$error":"#N/A"}]
[null,null,null,null,null,null,null,null,null,null,null,null,null,0,{"$f":"IF(Data!B63>E$6,Data!B63-E$6,0)","v":0},{"$f":"IF(N48>0,Data!J63/'CB&P'!E$7,0)","v":0},{"$f":"IF(N48>0,G(E$14,((-J$20)*'CB&P'!E$13/1440)*'CB&P'!O48/Data!V$23^2,'CB&P'!Q$2),0)","v":0},0,null,40,17.020169751942593,{"$f":"G('CB&P'!E$14,((-J$20)*'CB&P'!E$13/1440)*'CB&P'!U48/Data!V$23^2,0.00001)","v":0.26546003203019214},null,{"$error":"#N/A"},{"$error":"#N/A"}]
[null,null,null,null,null,null,null,null,null,null,null,null,null,null,null,null,null,null,null,41,17.775014065067825,{"$f":"G('CB&P'!E$14,((-J$20)*'CB&P'!E$13/1440)*'CB&P'!U49/Data!V$23^2,0.00001)","v":0.25594431046638316}]
[null,null,null,null,null,null,null,null,null,null,null,null,null,null,null,null,null,null,null,42,18.56333571392836,{"$f":"G('CB&P'!E$14,((-J$20)*'CB&P'!E$13/1440)*'CB&P'!U50/Data!V$23^2,0.00001)","v":0.2465699095535529}]
[null,null,null,null,null,null,null,null,null,null,null,null,null,null,null,null,null,null,null,43,19.38661941794043,{"$f":"G('CB&P'!E$14,((-J$20)*'CB&P'!E$13/1440)*'CB&P'!U51/Data!V$23^2,0.00001)","v":0.23734626827108415}]
[null,null,null,null,null,null,null,null,null,null,null,null,null,null,null,null,null,null,null,44,20.246415743807585,{"$f":"G('CB&P'!E$14,((-J$20)*'CB&P'!E$13/1440)*'CB&P'!U52/Data!V$23^2,0.00001)","v":0.22828247337219079}]
[null,null,null,null,null,null,null,null,null,null,null,null,null,null,null,null,null,null,null,45,21.144344025847097,{"$f":"G('CB&P'!E$14,((-J$20)*'CB&P'!E$13/1440)*'CB&P'!U53/Data!V$23^2,0.00001)","v":0.2193872126754246}]
[null,null,null,null,null,null,null,null,null,null,null,null,null,null,null,null,null,null,null,46,22.082095415832644,{"$f":"G('CB&P'!E$14,((-J$20)*'CB&P'!E$13/1440)*'CB&P'!U54/Data!V$23^2,0.00001)","v":0.21066872972132564}]
[null,null,null,null,null,null,null,null,null,null,null,null,null,null,null,null,null,null,null,47,23.061436068097755,{"$f":"G('CB&P'!E$14,((-J$20)*'CB&P'!E$13/1440)*'CB&P'!U55/Data!V$23^2,0.00001)","v":0.20213478028525483}]
[null,null,null,null,null,null,null,null,null,null,null,null,null,null,null,null,null,null,null,48,24.084210465898217,{"$f":"G('CB&P'!E$14,((-J$20)*'CB&P'!E$13/1440)*'CB&P'!U56/Data!V$23^2,0.00001)","v":0.19379259124006545}]
[null,null,null,null,null,null,null,null,null,null,null,null,null,null,null,null,null,null,null,49,25.152344895298928,{"$f":"G('CB&P'!E$14,((-J$20)*'CB&P'!E$13/1440)*'CB&P'!U57/Data!V$23^2,0.00001)","v":0.18564882225768167}]
[null,null,null,null,null,null,null,null,null,null,null,null,null,null,null,null,null,null,null,50,26.2678510731274,{"$f":"G('CB&P'!E$14,((-J$20)*'CB&P'!E$13/1440)*'CB&P'!U58/Data!V$23^2,0.00001)","v":0.17770953082628185}]
[null,null,null,null,null,null,null,null,null,null,null,null,null,null,null,null,null,null,null,51,27.432829935826916,{"$f":"G('CB&P'!E$14,((-J$20)*'CB&P'!E$13/1440)*'CB&P'!U59/Data!V$23^2,0.00001)","v":0.16998014103901865}]
[null,null,null,null,null,null,null,null,null,null,null,null,null,null,null,null,null,null,null,52,28.649475596345521,{"$f":"G('CB&P'!E$14,((-J$20)*'CB&P'!E$13/1440)*'CB&P'!U60/Data!V$23^2,0.00001)","v":0.16246541658079525}]
[null,null,null,null,null,null,null,null,null,null,null,null,null,null,null,null,null,null,null,53,29.920079476512655,{"$f":"G('CB&P'!E$14,((-J$20)*'CB&P'!E$13/1440)*'CB&P'!U61/Data!V$23^2,0.00001)","v":0.15516943830140684}]
[null,null,null,null,null,null,null,null,null,null,null,null,null,null,null,null,null,null,null,54,31.247034622686964,{"$f":"G('CB&P'!E$14,((-J$20)*'CB&P'!E$13/1440)*'CB&P'!U62/Data!V$23^2,0.00001)","v":0.14809558671646697}]
[null,null,null,null,null,null,null,null,null,null,null,null,null,null,null,null,null,null,null,55,32.632840212802826,{"$f":"G('CB&P'!E$14,((-J$20)*'CB&P'!E$13/1440)*'CB&P'!U63/Data!V$23^2,0.00001)","v":0.14124652972234258}]
[null,null,null,null,null,null,null,null,null,null,null,null,null,null,null,null,null,null,null,56,34.080106263304302,{"$f":"G('CB&P'!E$14,((-J$20)*'CB&P'!E$13/1440)*'CB&P'!U64/Data!V$23^2,0.00001)","v":0.1346242157484219}]
[null,null,null,null,null,null,null,null,null,null,null,null,null,null,null,null,null,null,null,57,35.591558544831827,{"$f":"G('CB&P'!E$14,((-J$20)*'CB&P'!E$13/1440)*'CB&P'!U65/Data!V$23^2,0.00001)","v":0.12822979530629816}]
[null,null,null,null,null,null,null,null,null,null,null,null,null,null,null,null,null,null,null,58,37.170043715919128,{"$f":"G('CB&P'!E$14,((-J$20)*'CB&P'!E$13/1440)*'CB&P'!U66/Data!V$23^2,0.00001)","v":0.12206394677725836}]
[null,null,null,null,null,null,null,null,null,null,null,null,null,null,null,null,null,null,null,59,38.818534684369986,{"$f":"G('CB&P'!E$14,((-J$20)*'CB&P'!E$13/1440)*'CB&P'!U67/Data!V$23^2,0.00001)","v":0.11612638610091787}]
[null,null,null,null,null,null,null,null,null,null,null,null,null,null,null,null,null,null,null,60,40.540136206411653,{"$f":"G('CB&P'!E$14,((-J$20)*'CB&P'!E$13/1440)*'CB&P'!U68/Data!V$23^2,0.00001)","v":0.11041622789728106}]
[null,null,null,null,null,null,null,null,null,null,null,null,null,null,null,null,null,null,null,61,42.338090734170663,{"$f":"G('CB&P'!E$14,((-J$20)*'CB&P'!E$13/1440)*'CB&P'!U69/Data!V$23^2,0.00001)","v":0.10493191729733747}]
[null,null,null,null,null,null,null,null,null,null,null,null,null,null,null,null,null,null,null,62,44.215784522484491,{"$f":"G('CB&P'!E$14,((-J$20)*'CB&P'!E$13/1440)*'CB&P'!U70/Data!V$23^2,0.00001)","v":9.9671256186384671E-2}]
[null,null,null,null,null,null,null,null,null,null,null,null,null,null,null,null,null,null,null,63,46.176754006549636,{"$f":"G('CB&P'!E$14,((-J$20)*'CB&P'!E$13/1440)*'CB&P'!U71/Data!V$23^2,0.00001)","v":9.4631434281561164E-2}]
[null,null,null,null,null,null,null,null,null,null,null,null,null,null,null,null,null,null,null,64,{"$f":"EXP(LN(J$15)+(LN(J$16)-LN(J$15))*T72/100)","v":48.224692462418943},{"$f":"G('CB&P'!E$14,((-J$20)*'CB&P'!E$13/1440)*'CB&P'!U72/Data!V$23^2,0.00001)","v":8.9809040690964057E-2}]
[null,null,null,null,null,null,null,null,null,null,null,null,null,null,null,null,null,null,null,65,50.363456962891462,{"$f":"G('CB&P'!E$14,((-J$20)*'CB&P'!E$13/1440)*'CB&P'!U73/Data!V$23^2,0.00001)","v":8.5200181968581798E-2}]
[null,null,null,null,null,null,null,null,null,null,null,null,null,null,null,null,null,null,null,66,52.597075641895941,{"$f":"G('CB&P'!E$14,((-J$20)*'CB&P'!E$13/1440)*'CB&P'!U74/Data!V$23^2,0.00001)","v":8.0800432106069034E-2}]
[null,null,null,null,null,null,null,null,null,null,null,null,null,null,null,null,null,null,null,67,54.929755281050078,{"$f":"G('CB&P'!E$14,((-J$20)*'CB&P'!E$13/1440)*'CB&P'!U75/Data!V$23^2,0.00001)","v":7.6604923990030924E-2}]
[null,null,null,null,null,null,null,null,null,null,null,null,null,null,null,null,null,null,null,68,57.365889232682903,{"$f":"G('CB&P'!E$14,((-J$20)*'CB&P'!E$13/1440)*'CB&P'!U76/Data!V$23^2,0.00001)","v":7.2608389827794342E-2}]
[null,null,null,null,null,null,null,null,null,null,null,null,null,null,null,null,null,null,null,69,59.910065694243769,{"$f":"G('CB&P'!E$14,((-J$20)*'CB&P'!E$13/1440)*'CB&P'!U77/Data!V$23^2,0.00001)","v":6.88052106428855E-2}]
[null,null,null,null,null,null,null,null,null,null,null,null,null,null,null,null,null,null,null,70,62.567076349680882,{"$f":"G('CB&P'!E$14,((-J$20)*'CB&P'!E$13/1440)*'CB&P'!U78/Data!V$23^2,0.00001)","v":6.5189466677253186E-2}]
[null,null,null,null,null,null,null,null,null,null,null,null,null,null,null,null,null,null,null,71,65.341925394064731,{"$f":"G('CB&P'!E$14,((-J$20)*'CB&P'!E$13/1440)*'CB&P'!U79/Data!V$23^2,0.00001)","v":6.1754988042615311E-2}]
[null,null,null,null,null,null,null,null,null,null,null,null,null,null,null,null,null,null,null,72,68.239838958454101,{"$f":"G('CB&P'!E$14,((-J$20)*'CB&P'!E$13/1440)*'CB&P'!U80/Data!V$23^2,0.00001)","v":5.8495402447204456E-2}]
[null,null,null,null,null,null,null,null,null,null,null,null,null,null,null,null,null,null,null,73,71.266274952753832,{"$f":"G('CB&P'!E$14,((-J$20)*'CB&P'!E$13/1440)*'CB&P'!U81/Data!V$23^2,0.00001)","v":5.5404195868479937E-2}]
[null,null,null,null,null,null,null,null,null,null,null,null,null,null,null,null,null,null,null,74,74.426933345104217,{"$f":"G('CB&P'!E$14,((-J$20)*'CB&P'!E$13/1440)*'CB&P'!U82/Data!V$23^2,0.00001)","v":5.2474740512021834E-2}]
[null,null,null,null,null,null,null,null,null,null,null,null,null,null,null,null,null,null,null,75,77.727766897160393,{"$f":"G('CB&P'!E$14,((-J$20)*'CB&P'!E$13/1440)*'CB&P'!U83/Data!V$23^2,0.00001)","v":4.9700355991456599E-2}]
[null,null,null,null,null,null,null,null,null,null,null,null,null,null,null,null,null,null,null,76,81.174992375481409,{"$f":"G('CB&P'!E$14,((-J$20)*'CB&P'!E$13/1440)*'CB&P'!U84/Data!V$23^2,0.00001)","v":4.7074347423349587E-2}]
[null,null,null,null,null,null,null,null,null,null,null,null,null,null,null,null,null,null,null,77,84.775102260144806,{"$f":"G('CB&P'!E$14,((-J$20)*'CB&P'!E$13/1440)*'CB&P'!U85/Data!V$23^2,0.00001)","v":4.4590045561682584E-2}]
[null,null,null,null,null,null,null,null,null,null,null,null,null,null,null,null,null,null,null,78,88.534876972637122,{"$f":"G('CB&P'!E$14,((-J$20)*'CB&P'!E$13/1440)*'CB&P'!U86/Data!V$23^2,0.00001)","v":4.2240843641744068E-2}]
[null,null,null,null,null,null,null,null,null,null,null,null,null,null,null,null,null,null,null,79,92.461397646052234,{"$f":"G('CB&P'!E$14,((-J$20)*'CB&P'!E$13/1440)*'CB&P'!U87/Data!V$23^2,0.00001)","v":4.0020230705298379E-2}]
[null,null,null,null,null,null,null,null,null,null,null,null,null,null,null,null,null,null,null,80,96.562059461647166,{"$f":"G('CB&P'!E$14,((-J$20)*'CB&P'!E$13/1440)*'CB&P'!U88/Data!V$23^2,0.00001)","v":3.7921799100376845E-2}]
[null,null,null,null,null,null,null,null,null,null,null,null,null,null,null,null,null,null,null,81,100.84458557687381,{"$f":"G('CB&P'!E$14,((-J$20)*'CB&P'!E$13/1440)*'CB&P'!U89/Data!V$23^2,0.00001)","v":3.5939356831948294E-2}]
[null,null,null,null,null,null,null,null,null,null,null,null,null,null,null,null,null,null,null,82,105.31704167111972,{"$f":"G('CB&P'!E$14,((-J$20)*'CB&P'!E$13/1440)*'CB&P'!U90/Data!V$23^2,0.00001)","v":3.4066823159329573E-2}]
[null,null,null,null,null,null,null,null,null,null,null,null,null,null,null,null,null,null,null,83,109.98785113655084,{"$f":"G('CB&P'!E$14,((-J$20)*'CB&P'!E$13/1440)*'CB&P'!U91/Data!V$23^2,0.00001)","v":3.2298329352524316E-2}]
[null,null,null,null,null,null,null,null,null,null,null,null,null,null,null,null,null,null,null,84,114.86581094266936,{"$f":"G('CB&P'!E$14,((-J$20)*'CB&P'!E$13/1440)*'CB&P'!U92/Data!V$23^2,0.00001)","v":3.0628213446252713E-2}]
[null,null,null,null,null,null,null,null,null,null,null,null,null,null,null,null,null,null,null,85,119.96010820446357,{"$f":"G('CB&P'!E$14,((-J$20)*'CB&P'!E$13/1440)*'CB&P'!U93/Data!V$23^2,0.00001)","v":2.9051031662493596E-2}]
[null,null,null,null,null,null,null,null,null,null,null,null,null,null,null,null,null,null,null,86,125.28033748535495,{"$f":"G('CB&P'!E$14,((-J$20)*'CB&P'!E$13/1440)*'CB&P'!U94/Data!V$23^2,0.00001)","v":2.7561566627136852E-2}]
[null,null,null,null,null,null,null,null,null,null,null,null,null,null,null,null,null,null,null,87,130.83651886753174,{"$f":"G('CB&P'!E$14,((-J$20)*'CB&P'!E$13/1440)*'CB&P'!U95/Data!V$23^2,0.00001)","v":2.6154832628269852E-2}]
[null,null,null,null,null,null,null,null,null,null,null,null,null,null,null,null,null,null,null,88,136.63911682369996,{"$f":"G('CB&P'!E$14,((-J$20)*'CB&P'!E$13/1440)*'CB&P'!U96/Data!V$23^2,0.00001)","v":2.4826078188669932E-2}]
[null,null,null,null,null,null,null,null,null,null,null,null,null,null,null,null,null,null,null,89,142.69905992579814,{"$f":"G('CB&P'!E$14,((-J$20)*'CB&P'!E$13/1440)*'CB&P'!U97/Data!V$23^2,0.00001)","v":2.3570786241004008E-2}]
[null,null,null,null,null,null,null,null,null,null,null,null,null,null,null,null,null,null,null,90,149.02776142779189,{"$f":"G('CB&P'!E$14,((-J$20)*'CB&P'!E$13/1440)*'CB&P'!U98/Data!V$23^2,0.00001)","v":2.2384672201593216E-2}]
[null,null,null,null,null,null,null,null,null,null,null,null,null,null,null,null,null,null,null,91,155.63714076131546,{"$f":"G('CB&P'!E$14,((-J$20)*'CB&P'!E$13/1440)*'CB&P'!U99/Data!V$23^2,0.00001)","v":2.1263680238167958E-2}]
[null,null,null,null,null,null,null,null,null,null,null,null,null,null,null,null,null,null,null,92,162.5396459846458,{"$f":"G('CB&P'!E$14,((-J$20)*'CB&P'!E$13/1440)*'CB&P'!U100/Data!V$23^2,0.00001)","v":2.0203978019800884E-2}]
[null,null,null,null,null,null,null,null,null,null,null,null,null,null,null,null,null,null,null,93,169.74827722728631,{"$f":"G('CB&P'!E$14,((-J$20)*'CB&P'!E$13/1440)*'CB&P'!U101/Data!V$23^2,0.00001)","v":1.9201950224261681E-2}]
[null,null,null,null,null,null,null,null,null,null,null,null,null,null,null,null,null,null,null,94,177.27661117431998,{"$f":"G('CB&P'!E$14,((-J$20)*'CB&P'!E$13/1440)*'CB&P'!U102/Data!V$23^2,0.00001)","v":1.8254191060550502E-2}]
[null,null,null,null,null,null,null,null,null,null,null,null,null,null,null,null,null,null,null,95,185.1388266366408,{"$f":"G('CB&P'!E$14,((-J$20)*'CB&P'!E$13/1440)*'CB&P'!U103/Data!V$23^2,0.00001)","v":1.7357496043503805E-2}]
[null,null,null,null,null,null,null,null,null,null,null,null,null,null,null,null,null,null,null,96,{"$f":"EXP(LN(J$15)+(LN(J$16)-LN(J$15))*T104/100)","v":193.349731255227},{"$f":"G('CB&P'!E$14,((-J$20)*'CB&P'!E$13/1440)*'CB&P'!U104/Data!V$23^2,0.00001)","v":1.6508853234240357E-2}]
[null,null,null,null,null,null,null,null,null,null,null,null,null,null,null,null,null,null,null,97,201.92478938974679,{"$f":"G('CB&P'!E$14,((-J$20)*'CB&P'!E$13/1440)*'CB&P'!U105/Data!V$23^2,0.00001)","v":1.5705434135859366E-2}]
[null,null,null,null,null,null,null,null,null,null,null,null,null,null,null,null,null,null,null,98,210.88015124402349,{"$f":"G('CB&P'!E$14,((-J$20)*'CB&P'!E$13/1440)*'CB&P'!U106/Data!V$23^2,0.00001)","v":1.4944584409119707E-2}]
[null,null,null,null,null,null,null,null,null,null,null,null,null,null,null,null,null,null,null,99,220.23268328321629,{"$f":"G('CB&P'!E$14,((-J$20)*'CB&P'!E$13/1440)*'CB&P'!U107/Data!V$23^2,0.00001)","v":1.4223814548592071E-2}]
[null,null,null,null,null,null,null,null,null,null,null,null,null,null,null,null,null,null,null,100,230.00000000000006,{"$f":"G('CB&P'!E$14,((-J$20)*'CB&P'!E$13/1440)*'CB&P'!U108/Data!V$23^2,0.00001)","v":1.3540790636602752E-2}]

{"sheet":"B&R Type Curve","index":6,"n_rows":56,"n_cols":30,"rows_kept":56,"cut":false,"hidden":false,"merged":[[4,3,4,4]]}
["Bouwer and Rice Short Term LNAPL Mobility Test Type Curves"]
[{"$f":"CONCATENATE(\"B&R Type Curves:  Casing Rad. (ft) = \",Data!B6,\" ;  Borehole Rad. (ft) = \",Data!B7)","v":"B&R Type Curves:  Casing Rad. (ft) = 0.0833333333333333 ;  Borehole Rad. (ft) = 0.333333333333333"}]
[]
[]
[null,null,null,"Enter these values"]
["Type Curve ID","Type Curve Name","Notes","Max Time (min)","Transmissivity (ft2/day)"]
[1,{"$f":"CONCATENATE(\"T=\",E7,\" ft2/day\")","v":"T=10 ft2/day"},null,150,10,null,"J-Ratio",null,null,null,"Type Curve 1",null,null,"Type Curve 2",null,null,"Type Curve 3",null,null,"Type Curve 4",null,null,"Type Curve 5",null,null,"Type Curve 6",null,null,"Type Curve 7"]
[2,"T=5 ft2/day",null,200,5,null,{"$f":"Figures!U27","v":-1.2765957446808507},"<--  If uncertain use",null,null,null,"T (ft2/day)",null,null,"T (ft2/day)",null,null,"T (ft2/day)",null,null,"T (ft2/day)",null,null,"T (ft2/day)",null,null,"T (ft2/day)",null,null,"T (ft2/day)"]
[3,"T=2 ft2/day",null,200,2,null,null,{"$f":"-(1-Data!B9)","v":-0.21999999999999997},null,null,null,{"$f":"E7","v":10},null,null,{"$f":"E8","v":5},null,null,{"$f":"E9","v":2},null,null,{"$f":"E10","v":1},null,null,{"$f":"E11","v":0.5},null,null,{"$f":"E12","v":0.2},null,null,{"$f":"E13","v":0.1}]
[4,"T=1 ft2/day",null,200,1]
[5,"T=0.5 ft2/day",null,200,0.5,null,null,null,null,null,"t (min)","s(t)/s0",null,"t (min)","s(t)/s0",null,"t (min)","s(t)/s0",null,"t (min)","s(t)/s0",null,"t (min)","s(t)/s0",null,"t (min)","s(t)/s0",null,"t (min)","s(t)/s0"]
[6,"T=0.2 ft2/day",null,200,0.2,null,null,null,null,null,0,{"$f":"EXP(-(2*L$9*(K12/1440)*(-G$8)/(Data!B$13^2*LN('B&R'!$J$12))))","v":1},null,0,{"$f":"EXP(-(2*O$9*(N12/1440)*(-G$8))/(Data!B$13^2*LN('B&R'!$J$12)))","v":1},null,0,{"$f":"EXP(-(2*R$9*(Q12/1440)*(-G$8))/(Data!B$13^2*LN('B&R'!$J$12)))","v":1},null,0,{"$f":"EXP(-(2*U$9*(T12/1440)*(-G$8))/(Data!B$13^2*LN('B&R'!J$12)))","v":1},null,0,{"$f":"EXP(-(2*X$9*(W12/1440)*(-G$8))/(Data!B$13^2*LN('B&R'!$J$12)))","v":1},null,0,{"$f":"EXP(-(2*AA$9*(Z12/1440)*(-G$8))/(Data!B$13^2*LN('B&R'!$J$12)))","v":1},null,0,{"$f":"EXP(-(2*AD$9*(AC12/1440)*(-G$8))/(Data!B$13^2*LN('B&R'!$J$12)))","v":1}]
[7,"T=0.1 ft2/day",null,200,0.1,null,null,null,null,null,{"$f":"(K$42-K$12)/30+K12","v":5},{"$f":"EXP(-(2*L$9*(K13/1440)*(-G$8)/(Data!B$13^2*LN('B&R'!$J$12))))","v":0.34556131375482324},null,{"$f":"(N$42-N$12)/30+N12","v":6.666666666666667},{"$f":"EXP(-(2*O$9*(N13/1440)*(-G$8))/(Data!B$13^2*LN('B&R'!$J$12)))","v":0.49243632054124431},null,{"$f":"(Q$42-Q$12)/30+Q12","v":6.666666666666667},{"$f":"EXP(-(2*R$9*(Q13/1440)*(-G$8))/(Data!B$13^2*LN('B&R'!$J$12)))","v":0.75325154485892787},null,{"$f":"(T$42-T$12)/30+T12","v":6.666666666666667},{"$f":"EXP(-(2*U$9*(T13/1440)*(-G$8))/(Data!B$13^2*LN('B&R'!J$12)))","v":0.8679006537956564},null,{"$f":"(W$42-W$12)/30+W12","v":6.666666666666667},{"$f":"EXP(-(2*X$9*(W13/1440)*(-G$8))/(Data!B$13^2*LN('B&R'!$J$12)))","v":0.93161185790846202},null,{"$f":"(Z$42-Z$12)/30+Z12","v":6.666666666666667},{"$f":"EXP(-(2*AA$9*(Z13/1440)*(-G$8))/(Data!B$13^2*LN('B&R'!$J$12)))","v":0.97206208315289122},null,{"$f":"(AC$42-AC$12)/30+AC12","v":6.666666666666667},{"$f":"EXP(-(2*AD$9*(AC13/1440)*(-G$8))/(Data!B$13^2*LN('B&R'!$J$12)))","v":0.98593208850959468}]
[null,null,null,null,null,null,null,null,null,null,10,{"$f":"EXP(-(2*L$9*(K14/1440)*(-G$8)/(Data!B$13^2*LN('B&R'!$J$12))))","v":0.1194126215639594},null,13.333333333333334,{"$f":"EXP(-(2*O$9*(N14/1440)*(-G$8))/(Data!B$13^2*LN('B&R'!$J$12)))","v":0.24249352978819913},null,13.333333333333334,{"$f":"EXP(-(2*R$9*(Q14/1440)*(-G$8))/(Data!B$13^2*LN('B&R'!$J$12)))","v":0.56738788983236144},null,13.333333333333334,{"$f":"EXP(-(2*U$9*(T14/1440)*(-G$8))/(Data!B$13^2*LN('B&R'!J$12)))","v":0.75325154485892787},null,13.333333333333334,{"$f":"EXP(-(2*X$9*(W14/1440)*(-G$8))/(Data!B$13^2*LN('B&R'!$J$12)))","v":0.8679006537956564},null,13.333333333333334,{"$f":"EXP(-(2*AA$9*(Z14/1440)*(-G$8))/(Data!B$13^2*LN('B&R'!$J$12)))","v":0.94490469350353834},null,13.333333333333334,{"$f":"EXP(-(2*AD$9*(AC14/1440)*(-G$8))/(Data!B$13^2*LN('B&R'!$J$12)))","v":0.97206208315289122}]
[null,null,null,null,null,null,null,null,null,null,15,{"$f":"EXP(-(2*L$9*(K15/1440)*(-G$8)/(Data!B$13^2*LN('B&R'!$J$12))))","v":4.1264382386549364E-2},null,20,{"$f":"EXP(-(2*O$9*(N15/1440)*(-G$8))/(Data!B$13^2*LN('B&R'!$J$12)))","v":0.1194126215639594},null,20,{"$f":"EXP(-(2*R$9*(Q15/1440)*(-G$8))/(Data!B$13^2*LN('B&R'!$J$12)))","v":0.42738580455047337},null,20,{"$f":"EXP(-(2*U$9*(T15/1440)*(-G$8))/(Data!B$13^2*LN('B&R'!J$12)))","v":0.65374750825565164},null,20,{"$f":"EXP(-(2*X$9*(W15/1440)*(-G$8))/(Data!B$13^2*LN('B&R'!$J$12)))","v":0.80854654056254038},null,20,{"$f":"EXP(-(2*AA$9*(Z15/1440)*(-G$8))/(Data!B$13^2*LN('B&R'!$J$12)))","v":0.9185060247479937},null,20,{"$f":"EXP(-(2*AD$9*(AC15/1440)*(-G$8))/(Data!B$13^2*LN('B&R'!$J$12)))","v":0.95838719980391729}]
[null,null,null,null,null,null,null,null,null,null,20,{"$f":"EXP(-(2*L$9*(K16/1440)*(-G$8)/(Data!B$13^2*LN('B&R'!$J$12))))","v":1.4259374188777383E-2},null,26.666666666666668,{"$f":"EXP(-(2*O$9*(N16/1440)*(-G$8))/(Data!B$13^2*LN('B&R'!$J$12)))","v":5.8803111989140219E-2},null,26.666666666666668,{"$f":"EXP(-(2*R$9*(Q16/1440)*(-G$8))/(Data!B$13^2*LN('B&R'!$J$12)))","v":0.32192901752841985},null,26.666666666666668,{"$f":"EXP(-(2*U$9*(T16/1440)*(-G$8))/(Data!B$13^2*LN('B&R'!J$12)))","v":0.56738788983236144},null,26.666666666666668,{"$f":"EXP(-(2*X$9*(W16/1440)*(-G$8))/(Data!B$13^2*LN('B&R'!$J$12)))","v":0.75325154485892787},null,26.666666666666668,{"$f":"EXP(-(2*AA$9*(Z16/1440)*(-G$8))/(Data!B$13^2*LN('B&R'!$J$12)))","v":0.89284487980501581},null,26.666666666666668,{"$f":"EXP(-(2*AD$9*(AC16/1440)*(-G$8))/(Data!B$13^2*LN('B&R'!$J$12)))","v":0.94490469350353834}]
[null,null,null,null,null,null,null,null,null,null,25,{"$f":"EXP(-(2*L$9*(K17/1440)*(-G$8)/(Data!B$13^2*LN('B&R'!$J$12))))","v":4.9274880779955317E-3},null,33.333333333333336,{"$f":"EXP(-(2*O$9*(N17/1440)*(-G$8))/(Data!B$13^2*LN('B&R'!$J$12)))","v":2.8956788104306939E-2},null,33.333333333333336,{"$f":"EXP(-(2*R$9*(Q17/1440)*(-G$8))/(Data!B$13^2*LN('B&R'!$J$12)))","v":0.24249352978819913},null,33.333333333333336,{"$f":"EXP(-(2*U$9*(T17/1440)*(-G$8))/(Data!B$13^2*LN('B&R'!J$12)))","v":0.49243632054124431},null,33.333333333333336,{"$f":"EXP(-(2*X$9*(W17/1440)*(-G$8))/(Data!B$13^2*LN('B&R'!$J$12)))","v":0.701738071178445},null,33.333333333333336,{"$f":"EXP(-(2*AA$9*(Z17/1440)*(-G$8))/(Data!B$13^2*LN('B&R'!$J$12)))","v":0.8679006537956564},null,33.333333333333336,{"$f":"EXP(-(2*AD$9*(AC17/1440)*(-G$8))/(Data!B$13^2*LN('B&R'!$J$12)))","v":0.93161185790846202}]
[null,null,null,null,null,null,null,null,null,null,30,{"$f":"EXP(-(2*L$9*(K18/1440)*(-G$8)/(Data!B$13^2*LN('B&R'!$J$12))))","v":1.7027492537433657E-3},null,40,{"$f":"EXP(-(2*O$9*(N18/1440)*(-G$8))/(Data!B$13^2*LN('B&R'!$J$12)))","v":1.4259374188777383E-2},null,40,{"$f":"EXP(-(2*R$9*(Q18/1440)*(-G$8))/(Data!B$13^2*LN('B&R'!$J$12)))","v":0.18265862593125543},null,40,{"$f":"EXP(-(2*U$9*(T18/1440)*(-G$8))/(Data!B$13^2*LN('B&R'!J$12)))","v":0.42738580455047337},null,40,{"$f":"EXP(-(2*X$9*(W18/1440)*(-G$8))/(Data!B$13^2*LN('B&R'!$J$12)))","v":0.65374750825565164},null,40,{"$f":"EXP(-(2*AA$9*(Z18/1440)*(-G$8))/(Data!B$13^2*LN('B&R'!$J$12)))","v":0.84365331749836203},null,40,{"$f":"EXP(-(2*AD$9*(AC18/1440)*(-G$8))/(Data!B$13^2*LN('B&R'!$J$12)))","v":0.9185060247479937}]
[null,null,null,null,null,null,null,null,null,null,35,{"$f":"EXP(-(2*L$9*(K19/1440)*(-G$8)/(Data!B$13^2*LN('B&R'!$J$12))))","v":5.8840426911860202E-4},null,46.666666666666664,{"$f":"EXP(-(2*O$9*(N19/1440)*(-G$8))/(Data!B$13^2*LN('B&R'!$J$12)))","v":7.0218337587423249E-3},null,46.666666666666664,{"$f":"EXP(-(2*R$9*(Q19/1440)*(-G$8))/(Data!B$13^2*LN('B&R'!$J$12)))","v":0.13758789216452719},null,46.666666666666664,{"$f":"EXP(-(2*U$9*(T19/1440)*(-G$8))/(Data!B$13^2*LN('B&R'!J$12)))","v":0.37092841919233849},null,46.666666666666664,{"$f":"EXP(-(2*X$9*(W19/1440)*(-G$8))/(Data!B$13^2*LN('B&R'!$J$12)))","v":0.60903893076907534},null,46.666666666666664,{"$f":"EXP(-(2*AA$9*(Z19/1440)*(-G$8))/(Data!B$13^2*LN('B&R'!$J$12)))","v":0.8200834012663053},null,46.666666666666664,{"$f":"EXP(-(2*AD$9*(AC19/1440)*(-G$8))/(Data!B$13^2*LN('B&R'!$J$12)))","v":0.90558456328843484}]
[null,null,null,null,null,null,null,null,null,null,40,{"$f":"EXP(-(2*L$9*(K20/1440)*(-G$8)/(Data!B$13^2*LN('B&R'!$J$12))))","v":2.0332975225557061E-4},null,53.333333333333329,{"$f":"EXP(-(2*O$9*(N20/1440)*(-G$8))/(Data!B$13^2*LN('B&R'!$J$12)))","v":3.4578059796073657E-3},null,53.333333333333329,{"$f":"EXP(-(2*R$9*(Q20/1440)*(-G$8))/(Data!B$13^2*LN('B&R'!$J$12)))","v":0.10363829232681367},null,53.333333333333329,{"$f":"EXP(-(2*U$9*(T20/1440)*(-G$8))/(Data!B$13^2*LN('B&R'!J$12)))","v":0.32192901752841985},null,53.333333333333329,{"$f":"EXP(-(2*X$9*(W20/1440)*(-G$8))/(Data!B$13^2*LN('B&R'!$J$12)))","v":0.56738788983236144},null,53.333333333333329,{"$f":"EXP(-(2*AA$9*(Z20/1440)*(-G$8))/(Data!B$13^2*LN('B&R'!$J$12)))","v":0.79717197939403306},null,53.333333333333329,{"$f":"EXP(-(2*AD$9*(AC20/1440)*(-G$8))/(Data!B$13^2*LN('B&R'!$J$12)))","v":0.89284487980501581}]
[null,null,null,null,null,null,null,null,null,null,45,{"$f":"EXP(-(2*L$9*(K21/1440)*(-G$8)/(Data!B$13^2*LN('B&R'!$J$12))))","v":7.0262896314877692E-5},null,59.999999999999993,{"$f":"EXP(-(2*O$9*(N21/1440)*(-G$8))/(Data!B$13^2*LN('B&R'!$J$12)))","v":1.7027492537433657E-3},null,59.999999999999993,{"$f":"EXP(-(2*R$9*(Q21/1440)*(-G$8))/(Data!B$13^2*LN('B&R'!$J$12)))","v":7.8065703801713598E-2},null,59.999999999999993,{"$f":"EXP(-(2*U$9*(T21/1440)*(-G$8))/(Data!B$13^2*LN('B&R'!J$12)))","v":0.27940240478870898},null,59.999999999999993,{"$f":"EXP(-(2*X$9*(W21/1440)*(-G$8))/(Data!B$13^2*LN('B&R'!$J$12)))","v":0.52858528620148804},null,59.999999999999993,{"$f":"EXP(-(2*AA$9*(Z21/1440)*(-G$8))/(Data!B$13^2*LN('B&R'!$J$12)))","v":0.77490065492087745},null,59.999999999999993,{"$f":"EXP(-(2*AD$9*(AC21/1440)*(-G$8))/(Data!B$13^2*LN('B&R'!$J$12)))","v":0.88028441706125726}]
[null,null,null,null,null,null,null,null,null,null,50,{"$f":"EXP(-(2*L$9*(K22/1440)*(-G$8)/(Data!B$13^2*LN('B&R'!$J$12))))","v":2.4280138758788098E-5},null,66.666666666666657,{"$f":"EXP(-(2*O$9*(N22/1440)*(-G$8))/(Data!B$13^2*LN('B&R'!$J$12)))","v":8.3849557731773407E-4},null,66.666666666666657,{"$f":"EXP(-(2*R$9*(Q22/1440)*(-G$8))/(Data!B$13^2*LN('B&R'!$J$12)))","v":5.8803111989140268E-2},null,66.666666666666657,{"$f":"EXP(-(2*U$9*(T22/1440)*(-G$8))/(Data!B$13^2*LN('B&R'!J$12)))","v":0.24249352978819924},null,66.666666666666657,{"$f":"EXP(-(2*X$9*(W22/1440)*(-G$8))/(Data!B$13^2*LN('B&R'!$J$12)))","v":0.49243632054124442},null,66.666666666666657,{"$f":"EXP(-(2*AA$9*(Z22/1440)*(-G$8))/(Data!B$13^2*LN('B&R'!$J$12)))","v":0.75325154485892798},null,66.666666666666657,{"$f":"EXP(-(2*AD$9*(AC22/1440)*(-G$8))/(Data!B$13^2*LN('B&R'!$J$12)))","v":0.86790065379565651}]
[null,null,null,null,null,null,null,null,null,null,55,{"$f":"EXP(-(2*L$9*(K23/1440)*(-G$8)/(Data!B$13^2*LN('B&R'!$J$12))))","v":8.3902766476362001E-6},null,73.333333333333329,{"$f":"EXP(-(2*O$9*(N23/1440)*(-G$8))/(Data!B$13^2*LN('B&R'!$J$12)))","v":4.1290567688445103E-4},null,73.333333333333329,{"$f":"EXP(-(2*R$9*(Q23/1440)*(-G$8))/(Data!B$13^2*LN('B&R'!$J$12)))","v":4.4293534948332408E-2},null,73.333333333333329,{"$f":"EXP(-(2*U$9*(T23/1440)*(-G$8))/(Data!B$13^2*LN('B&R'!J$12)))","v":0.21046029304439451},null,73.333333333333329,{"$f":"EXP(-(2*X$9*(W23/1440)*(-G$8))/(Data!B$13^2*LN('B&R'!$J$12)))","v":0.45875951548103555},null,73.333333333333329,{"$f":"EXP(-(2*AA$9*(Z23/1440)*(-G$8))/(Data!B$13^2*LN('B&R'!$J$12)))","v":0.73220726583370288},null,73.333333333333329,{"$f":"EXP(-(2*AD$9*(AC23/1440)*(-G$8))/(Data!B$13^2*LN('B&R'!$J$12)))","v":0.85569110421559413}]
[null,null,null,null,null,null,null,null,null,null,60,{"$f":"EXP(-(2*L$9*(K24/1440)*(-G$8)/(Data!B$13^2*LN('B&R'!$J$12))))","v":2.8993550211235884E-6},null,80,{"$f":"EXP(-(2*O$9*(N24/1440)*(-G$8))/(Data!B$13^2*LN('B&R'!$J$12)))","v":2.0332975225557061E-4},null,80,{"$f":"EXP(-(2*R$9*(Q24/1440)*(-G$8))/(Data!B$13^2*LN('B&R'!$J$12)))","v":3.3364173627094297E-2},null,80,{"$f":"EXP(-(2*U$9*(T24/1440)*(-G$8))/(Data!B$13^2*LN('B&R'!J$12)))","v":0.18265862593125543},null,80,{"$f":"EXP(-(2*X$9*(W24/1440)*(-G$8))/(Data!B$13^2*LN('B&R'!$J$12)))","v":0.42738580455047337},null,80,{"$f":"EXP(-(2*AA$9*(Z24/1440)*(-G$8))/(Data!B$13^2*LN('B&R'!$J$12)))","v":0.71175092012599206},null,80,{"$f":"EXP(-(2*AD$9*(AC24/1440)*(-G$8))/(Data!B$13^2*LN('B&R'!$J$12)))","v":0.84365331749836203}]
[null,null,null,null,null,null,null,null,null,null,65,{"$f":"EXP(-(2*L$9*(K25/1440)*(-G$8)/(Data!B$13^2*LN('B&R'!$J$12))))","v":1.0019049301411102E-6},null,86.666666666666671,{"$f":"EXP(-(2*O$9*(N25/1440)*(-G$8))/(Data!B$13^2*LN('B&R'!$J$12)))","v":1.0012695505729606E-4},null,86.666666666666671,{"$f":"EXP(-(2*R$9*(Q25/1440)*(-G$8))/(Data!B$13^2*LN('B&R'!$J$12)))","v":2.5131615327550268E-2},null,86.666666666666671,{"$f":"EXP(-(2*U$9*(T25/1440)*(-G$8))/(Data!B$13^2*LN('B&R'!J$12)))","v":0.15852954086715279},null,86.666666666666671,{"$f":"EXP(-(2*X$9*(W25/1440)*(-G$8))/(Data!B$13^2*LN('B&R'!$J$12)))","v":0.3981576834209693},null,86.666666666666671,{"$f":"EXP(-(2*AA$9*(Z25/1440)*(-G$8))/(Data!B$13^2*LN('B&R'!$J$12)))","v":0.69186608210365885},null,86.666666666666671,{"$f":"EXP(-(2*AD$9*(AC25/1440)*(-G$8))/(Data!B$13^2*LN('B&R'!$J$12)))","v":0.83178487729920825}]
[null,null,null,null,null,null,null,null,null,null,70,{"$f":"EXP(-(2*L$9*(K26/1440)*(-G$8)/(Data!B$13^2*LN('B&R'!$J$12))))","v":3.4621958391699629E-7},null,93.333333333333343,{"$f":"EXP(-(2*O$9*(N26/1440)*(-G$8))/(Data!B$13^2*LN('B&R'!$J$12)))","v":4.9306149335413364E-5},null,93.333333333333343,{"$f":"EXP(-(2*R$9*(Q26/1440)*(-G$8))/(Data!B$13^2*LN('B&R'!$J$12)))","v":1.893042807027754E-2},null,93.333333333333343,{"$f":"EXP(-(2*U$9*(T26/1440)*(-G$8))/(Data!B$13^2*LN('B&R'!J$12)))","v":0.1375878921645271},null,93.333333333333343,{"$f":"EXP(-(2*X$9*(W26/1440)*(-G$8))/(Data!B$13^2*LN('B&R'!$J$12)))","v":0.37092841919233838},null,93.333333333333343,{"$f":"EXP(-(2*AA$9*(Z26/1440)*(-G$8))/(Data!B$13^2*LN('B&R'!$J$12)))","v":0.6725367850325118},null,93.333333333333343,{"$f":"EXP(-(2*AD$9*(AC26/1440)*(-G$8))/(Data!B$13^2*LN('B&R'!$J$12)))","v":0.8200834012663053}]
[null,null,null,null,null,null,null,null,null,null,75,{"$f":"EXP(-(2*L$9*(K27/1440)*(-G$8)/(Data!B$13^2*LN('B&R'!$J$12))))","v":1.1964009426600525E-7},null,100.00000000000001,{"$f":"EXP(-(2*O$9*(N27/1440)*(-G$8))/(Data!B$13^2*LN('B&R'!$J$12)))","v":2.4280138758788098E-5},null,100.00000000000001,{"$f":"EXP(-(2*R$9*(Q27/1440)*(-G$8))/(Data!B$13^2*LN('B&R'!$J$12)))","v":1.4259374188777383E-2},null,100.00000000000001,{"$f":"EXP(-(2*U$9*(T27/1440)*(-G$8))/(Data!B$13^2*LN('B&R'!J$12)))","v":0.1194126215639594},null,100.00000000000001,{"$f":"EXP(-(2*X$9*(W27/1440)*(-G$8))/(Data!B$13^2*LN('B&R'!$J$12)))","v":0.34556131375482324},null,100.00000000000001,{"$f":"EXP(-(2*AA$9*(Z27/1440)*(-G$8))/(Data!B$13^2*LN('B&R'!$J$12)))","v":0.65374750825565164},null,100.00000000000001,{"$f":"EXP(-(2*AD$9*(AC27/1440)*(-G$8))/(Data!B$13^2*LN('B&R'!$J$12)))","v":0.80854654056254038}]
[null,null,null,null,null,null,null,null,null,null,80,{"$f":"EXP(-(2*L$9*(K28/1440)*(-G$8)/(Data!B$13^2*LN('B&R'!$J$12))))","v":4.1342988152311729E-8},null,106.66666666666669,{"$f":"EXP(-(2*O$9*(N28/1440)*(-G$8))/(Data!B$13^2*LN('B&R'!$J$12)))","v":1.1956422192608455E-5},null,106.66666666666669,{"$f":"EXP(-(2*R$9*(Q28/1440)*(-G$8))/(Data!B$13^2*LN('B&R'!$J$12)))","v":1.0740895636418083E-2},null,106.66666666666669,{"$f":"EXP(-(2*U$9*(T28/1440)*(-G$8))/(Data!B$13^2*LN('B&R'!J$12)))","v":0.10363829232681367},null,106.66666666666669,{"$f":"EXP(-(2*X$9*(W28/1440)*(-G$8))/(Data!B$13^2*LN('B&R'!$J$12)))","v":0.32192901752841985},null,106.66666666666669,{"$f":"EXP(-(2*AA$9*(Z28/1440)*(-G$8))/(Data!B$13^2*LN('B&R'!$J$12)))","v":0.63548316473100064},null,106.66666666666669,{"$f":"EXP(-(2*AD$9*(AC28/1440)*(-G$8))/(Data!B$13^2*LN('B&R'!$J$12)))","v":0.79717197939403306}]
[null,null,null,null,null,null,null,null,null,null,85,{"$f":"EXP(-(2*L$9*(K29/1440)*(-G$8)/(Data!B$13^2*LN('B&R'!$J$12))))","v":1.4286537300462927E-8},null,113.33333333333336,{"$f":"EXP(-(2*O$9*(N29/1440)*(-G$8))/(Data!B$13^2*LN('B&R'!$J$12)))","v":5.8877765513657682E-6},null,113.33333333333336,{"$f":"EXP(-(2*R$9*(Q29/1440)*(-G$8))/(Data!B$13^2*LN('B&R'!$J$12)))","v":8.0905962313004322E-3},null,113.33333333333336,{"$f":"EXP(-(2*U$9*(T29/1440)*(-G$8))/(Data!B$13^2*LN('B&R'!J$12)))","v":8.9947741668706907E-2},null,113.33333333333336,{"$f":"EXP(-(2*X$9*(W29/1440)*(-G$8))/(Data!B$13^2*LN('B&R'!$J$12)))","v":0.29991289013429701},null,113.33333333333336,{"$f":"EXP(-(2*AA$9*(Z29/1440)*(-G$8))/(Data!B$13^2*LN('B&R'!$J$12)))","v":0.6177290889170084},null,113.33333333333336,{"$f":"EXP(-(2*AD$9*(AC29/1440)*(-G$8))/(Data!B$13^2*LN('B&R'!$J$12)))","v":0.78595743454528655}]
[null,null,null,null,null,null,null,null,null,null,90,{"$f":"EXP(-(2*L$9*(K30/1440)*(-G$8)/(Data!B$13^2*LN('B&R'!$J$12))))","v":4.9368745985552525E-9},null,120.00000000000003,{"$f":"EXP(-(2*O$9*(N30/1440)*(-G$8))/(Data!B$13^2*LN('B&R'!$J$12)))","v":2.8993550211235731E-6},null,120.00000000000003,{"$f":"EXP(-(2*R$9*(Q30/1440)*(-G$8))/(Data!B$13^2*LN('B&R'!$J$12)))","v":6.0942541100568641E-3},null,120.00000000000003,{"$f":"EXP(-(2*U$9*(T30/1440)*(-G$8))/(Data!B$13^2*LN('B&R'!J$12)))","v":7.8065703801713487E-2},null,120.00000000000003,{"$f":"EXP(-(2*X$9*(W30/1440)*(-G$8))/(Data!B$13^2*LN('B&R'!$J$12)))","v":0.27940240478870881},null,120.00000000000003,{"$f":"EXP(-(2*AA$9*(Z30/1440)*(-G$8))/(Data!B$13^2*LN('B&R'!$J$12)))","v":0.60047102499680471},null,120.00000000000003,{"$f":"EXP(-(2*AD$9*(AC30/1440)*(-G$8))/(Data!B$13^2*LN('B&R'!$J$12)))","v":0.77490065492087734}]
[null,null,null,null,null,null,null,null,null,null,95,{"$f":"EXP(-(2*L$9*(K31/1440)*(-G$8)/(Data!B$13^2*LN('B&R'!$J$12))))","v":1.7059928721195742E-9},null,126.6666666666667,{"$f":"EXP(-(2*O$9*(N31/1440)*(-G$8))/(Data!B$13^2*LN('B&R'!$J$12)))","v":1.4277477185448702E-6},null,126.6666666666667,{"$f":"EXP(-(2*R$9*(Q31/1440)*(-G$8))/(Data!B$13^2*LN('B&R'!$J$12)))","v":4.5905063231632031E-3},null,126.6666666666667,{"$f":"EXP(-(2*U$9*(T31/1440)*(-G$8))/(Data!B$13^2*LN('B&R'!J$12)))","v":6.7753275368525198E-2},null,126.6666666666667,{"$f":"EXP(-(2*X$9*(W31/1440)*(-G$8))/(Data!B$13^2*LN('B&R'!$J$12)))","v":0.26029459342930117},null,126.6666666666667,{"$f":"EXP(-(2*AA$9*(Z31/1440)*(-G$8))/(Data!B$13^2*LN('B&R'!$J$12)))","v":0.58369511543134578},null,126.6666666666667,{"$f":"EXP(-(2*AD$9*(AC31/1440)*(-G$8))/(Data!B$13^2*LN('B&R'!$J$12)))","v":0.76399942109359331}]
[null,null,null,null,null,null,null,null,null,null,100,{"$f":"EXP(-(2*L$9*(K32/1440)*(-G$8)/(Data!B$13^2*LN('B&R'!$J$12))))","v":5.89525138146004E-10},null,133.33333333333337,{"$f":"EXP(-(2*O$9*(N32/1440)*(-G$8))/(Data!B$13^2*LN('B&R'!$J$12)))","v":7.0307483318139387E-7},null,133.33333333333337,{"$f":"EXP(-(2*R$9*(Q32/1440)*(-G$8))/(Data!B$13^2*LN('B&R'!$J$12)))","v":3.4578059796073627E-3},null,133.33333333333337,{"$f":"EXP(-(2*U$9*(T32/1440)*(-G$8))/(Data!B$13^2*LN('B&R'!J$12)))","v":5.8803111989140192E-2},null,133.33333333333337,{"$f":"EXP(-(2*X$9*(W32/1440)*(-G$8))/(Data!B$13^2*LN('B&R'!$J$12)))","v":0.24249352978819907},null,133.33333333333337,{"$f":"EXP(-(2*AA$9*(Z32/1440)*(-G$8))/(Data!B$13^2*LN('B&R'!$J$12)))","v":0.56738788983236133},null,133.33333333333337,{"$f":"EXP(-(2*AD$9*(AC32/1440)*(-G$8))/(Data!B$13^2*LN('B&R'!$J$12)))","v":0.75325154485892776}]
[null,null,null,null,null,null,null,null,null,null,105,{"$f":"EXP(-(2*L$9*(K33/1440)*(-G$8)/(Data!B$13^2*LN('B&R'!$J$12))))","v":2.03717081229226E-10},null,140.00000000000003,{"$f":"EXP(-(2*O$9*(N33/1440)*(-G$8))/(Data!B$13^2*LN('B&R'!$J$12)))","v":3.4621958391699629E-7},null,140.00000000000003,{"$f":"EXP(-(2*R$9*(Q33/1440)*(-G$8))/(Data!B$13^2*LN('B&R'!$J$12)))","v":2.6045976959616843E-3},null,140.00000000000003,{"$f":"EXP(-(2*U$9*(T33/1440)*(-G$8))/(Data!B$13^2*LN('B&R'!J$12)))","v":5.1035259340593969E-2},null,140.00000000000003,{"$f":"EXP(-(2*X$9*(W33/1440)*(-G$8))/(Data!B$13^2*LN('B&R'!$J$12)))","v":0.22590984781676512},null,140.00000000000003,{"$f":"EXP(-(2*AA$9*(Z33/1440)*(-G$8))/(Data!B$13^2*LN('B&R'!$J$12)))","v":0.55153625414616836},null,140.00000000000003,{"$f":"EXP(-(2*AD$9*(AC33/1440)*(-G$8))/(Data!B$13^2*LN('B&R'!$J$12)))","v":0.74265486879584131}]
[null,null,null,null,null,null,null,null,null,null,110,{"$f":"EXP(-(2*L$9*(K34/1440)*(-G$8)/(Data!B$13^2*LN('B&R'!$J$12))))","v":7.0396742223869341E-11},null,146.66666666666669,{"$f":"EXP(-(2*O$9*(N34/1440)*(-G$8))/(Data!B$13^2*LN('B&R'!$J$12)))","v":1.7049109800340608E-7},null,146.66666666666669,{"$f":"EXP(-(2*R$9*(Q34/1440)*(-G$8))/(Data!B$13^2*LN('B&R'!$J$12)))","v":1.9619172382191446E-3},null,146.66666666666669,{"$f":"EXP(-(2*U$9*(T34/1440)*(-G$8))/(Data!B$13^2*LN('B&R'!J$12)))","v":4.4293534948332408E-2},null,146.66666666666669,{"$f":"EXP(-(2*X$9*(W34/1440)*(-G$8))/(Data!B$13^2*LN('B&R'!$J$12)))","v":0.21046029304439451},null,146.66666666666669,{"$f":"EXP(-(2*AA$9*(Z34/1440)*(-G$8))/(Data!B$13^2*LN('B&R'!$J$12)))","v":0.53612748013966682},null,146.66666666666669,{"$f":"EXP(-(2*AD$9*(AC34/1440)*(-G$8))/(Data!B$13^2*LN('B&R'!$J$12)))","v":0.73220726583370288}]
[null,null,null,null,null,null,null,null,null,null,115,{"$f":"EXP(-(2*L$9*(K35/1440)*(-G$8)/(Data!B$13^2*LN('B&R'!$J$12))))","v":2.4326390726940005E-11},null,153.33333333333334,{"$f":"EXP(-(2*O$9*(N35/1440)*(-G$8))/(Data!B$13^2*LN('B&R'!$J$12)))","v":8.3956008985833897E-8},null,153.33333333333334,{"$f":"EXP(-(2*R$9*(Q35/1440)*(-G$8))/(Data!B$13^2*LN('B&R'!$J$12)))","v":1.4778171905739318E-3},null,153.33333333333334,{"$f":"EXP(-(2*U$9*(T35/1440)*(-G$8))/(Data!B$13^2*LN('B&R'!J$12)))","v":3.8442387940578457E-2},null,153.33333333333334,{"$f":"EXP(-(2*X$9*(W35/1440)*(-G$8))/(Data!B$13^2*LN('B&R'!$J$12)))","v":0.19606730461904773},null,153.33333333333334,{"$f":"EXP(-(2*AA$9*(Z35/1440)*(-G$8))/(Data!B$13^2*LN('B&R'!$J$12)))","v":0.52114919518007485},null,153.33333333333334,{"$f":"EXP(-(2*AD$9*(AC35/1440)*(-G$8))/(Data!B$13^2*LN('B&R'!$J$12)))","v":0.72190663882532269}]
[null,null,null,null,null,null,null,null,null,null,120,{"$f":"EXP(-(2*L$9*(K36/1440)*(-G$8)/(Data!B$13^2*LN('B&R'!$J$12))))","v":8.406259538514564E-12},null,160,{"$f":"EXP(-(2*O$9*(N36/1440)*(-G$8))/(Data!B$13^2*LN('B&R'!$J$12)))","v":4.1342988152311729E-8},null,160,{"$f":"EXP(-(2*R$9*(Q36/1440)*(-G$8))/(Data!B$13^2*LN('B&R'!$J$12)))","v":1.1131680818188946E-3},null,160,{"$f":"EXP(-(2*U$9*(T36/1440)*(-G$8))/(Data!B$13^2*LN('B&R'!J$12)))","v":3.3364173627094297E-2},null,160,{"$f":"EXP(-(2*X$9*(W36/1440)*(-G$8))/(Data!B$13^2*LN('B&R'!$J$12)))","v":0.18265862593125543},null,160,{"$f":"EXP(-(2*AA$9*(Z36/1440)*(-G$8))/(Data!B$13^2*LN('B&R'!$J$12)))","v":0.50658937230019629},null,160,{"$f":"EXP(-(2*AD$9*(AC36/1440)*(-G$8))/(Data!B$13^2*LN('B&R'!$J$12)))","v":0.71175092012599206}]
[null,null,null,null,null,null,null,null,null,null,125,{"$f":"EXP(-(2*L$9*(K37/1440)*(-G$8)/(Data!B$13^2*LN('B&R'!$J$12))))","v":2.9048780898930955E-12},null,166.66666666666666,{"$f":"EXP(-(2*O$9*(N37/1440)*(-G$8))/(Data!B$13^2*LN('B&R'!$J$12)))","v":2.0358788965904733E-8},null,166.66666666666666,{"$f":"EXP(-(2*R$9*(Q37/1440)*(-G$8))/(Data!B$13^2*LN('B&R'!$J$12)))","v":8.3849557731773255E-4},null,166.66666666666666,{"$f":"EXP(-(2*U$9*(T37/1440)*(-G$8))/(Data!B$13^2*LN('B&R'!J$12)))","v":2.8956788104306953E-2},null,166.66666666666666,{"$f":"EXP(-(2*X$9*(W37/1440)*(-G$8))/(Data!B$13^2*LN('B&R'!$J$12)))","v":0.17016694186682368},null,166.66666666666666,{"$f":"EXP(-(2*AA$9*(Z37/1440)*(-G$8))/(Data!B$13^2*LN('B&R'!$J$12)))","v":0.49243632054124431},null,166.66666666666666,{"$f":"EXP(-(2*AD$9*(AC37/1440)*(-G$8))/(Data!B$13^2*LN('B&R'!$J$12)))","v":0.701738071178445}]
[null,null,null,null,null,null,null,null,null,null,130,{"$f":"EXP(-(2*L$9*(K38/1440)*(-G$8)/(Data!B$13^2*LN('B&R'!$J$12))))","v":1.0038134890410629E-12},null,173.33333333333331,{"$f":"EXP(-(2*O$9*(N38/1440)*(-G$8))/(Data!B$13^2*LN('B&R'!$J$12)))","v":1.0025407129045785E-8},null,173.33333333333331,{"$f":"EXP(-(2*R$9*(Q38/1440)*(-G$8))/(Data!B$13^2*LN('B&R'!$J$12)))","v":6.3159808897196058E-4},null,173.33333333333331,{"$f":"EXP(-(2*U$9*(T38/1440)*(-G$8))/(Data!B$13^2*LN('B&R'!J$12)))","v":2.5131615327550288E-2},null,173.33333333333331,{"$f":"EXP(-(2*X$9*(W38/1440)*(-G$8))/(Data!B$13^2*LN('B&R'!$J$12)))","v":0.15852954086715287},null,173.33333333333331,{"$f":"EXP(-(2*AA$9*(Z38/1440)*(-G$8))/(Data!B$13^2*LN('B&R'!$J$12)))","v":0.47867867556546678},null,173.33333333333331,{"$f":"EXP(-(2*AD$9*(AC38/1440)*(-G$8))/(Data!B$13^2*LN('B&R'!$J$12)))","v":0.69186608210365885}]
[null,null,null,null,null,null,null,null,null,null,135,{"$f":"EXP(-(2*L$9*(K39/1440)*(-G$8)/(Data!B$13^2*LN('B&R'!$J$12))))","v":3.4687910803784237E-13},null,179.99999999999997,{"$f":"EXP(-(2*O$9*(N39/1440)*(-G$8))/(Data!B$13^2*LN('B&R'!$J$12)))","v":4.9368745985552707E-9},null,179.99999999999997,{"$f":"EXP(-(2*R$9*(Q39/1440)*(-G$8))/(Data!B$13^2*LN('B&R'!$J$12)))","v":4.757522362480763E-4},null,179.99999999999997,{"$f":"EXP(-(2*U$9*(T39/1440)*(-G$8))/(Data!B$13^2*LN('B&R'!J$12)))","v":2.1811745373721846E-2},null,179.99999999999997,{"$f":"EXP(-(2*X$9*(W39/1440)*(-G$8))/(Data!B$13^2*LN('B&R'!$J$12)))","v":0.14768800010062377},null,179.99999999999997,{"$f":"EXP(-(2*AA$9*(Z39/1440)*(-G$8))/(Data!B$13^2*LN('B&R'!$J$12)))","v":0.46530539053103465},null,179.99999999999997,{"$f":"EXP(-(2*AD$9*(AC39/1440)*(-G$8))/(Data!B$13^2*LN('B&R'!$J$12)))","v":0.68213297129741113}]
[null,null,null,null,null,null,null,null,null,null,140,{"$f":"EXP(-(2*L$9*(K40/1440)*(-G$8)/(Data!B$13^2*LN('B&R'!$J$12))))","v":1.1986800028765802E-13},null,186.66666666666663,{"$f":"EXP(-(2*O$9*(N40/1440)*(-G$8))/(Data!B$13^2*LN('B&R'!$J$12)))","v":2.4310963622861096E-9},null,186.66666666666663,{"$f":"EXP(-(2*R$9*(Q40/1440)*(-G$8))/(Data!B$13^2*LN('B&R'!$J$12)))","v":3.5836110692395344E-4},null,186.66666666666663,{"$f":"EXP(-(2*U$9*(T40/1440)*(-G$8))/(Data!B$13^2*LN('B&R'!J$12)))","v":1.8930428070277582E-2},null,186.66666666666663,{"$f":"EXP(-(2*X$9*(W40/1440)*(-G$8))/(Data!B$13^2*LN('B&R'!$J$12)))","v":0.13758789216452727},null,186.66666666666663,{"$f":"EXP(-(2*AA$9*(Z40/1440)*(-G$8))/(Data!B$13^2*LN('B&R'!$J$12)))","v":0.45230572722186718},null,186.66666666666663,{"$f":"EXP(-(2*AD$9*(AC40/1440)*(-G$8))/(Data!B$13^2*LN('B&R'!$J$12)))","v":0.67253678503251191}]
[null,null,null,null,null,null,null,null,null,null,145,{"$f":"EXP(-(2*L$9*(K41/1440)*(-G$8)/(Data!B$13^2*LN('B&R'!$J$12))))","v":4.142174365656677E-14},null,193.33333333333329,{"$f":"EXP(-(2*O$9*(N41/1440)*(-G$8))/(Data!B$13^2*LN('B&R'!$J$12)))","v":1.1971601475253724E-9},null,193.33333333333329,{"$f":"EXP(-(2*R$9*(Q41/1440)*(-G$8))/(Data!B$13^2*LN('B&R'!$J$12)))","v":2.6993605740782358E-4},null,193.33333333333329,{"$f":"EXP(-(2*U$9*(T41/1440)*(-G$8))/(Data!B$13^2*LN('B&R'!J$12)))","v":1.6429730898825566E-2},null,193.33333333333329,{"$f":"EXP(-(2*X$9*(W41/1440)*(-G$8))/(Data!B$13^2*LN('B&R'!$J$12)))","v":0.1281785118451044},null,193.33333333333329,{"$f":"EXP(-(2*AA$9*(Z41/1440)*(-G$8))/(Data!B$13^2*LN('B&R'!$J$12)))","v":0.43966924742527164},null,193.33333333333329,{"$f":"EXP(-(2*AD$9*(AC41/1440)*(-G$8))/(Data!B$13^2*LN('B&R'!$J$12)))","v":0.66307559706663288}]
[null,null,null,null,null,null,null,null,null,null,{"$f":"$D$7","v":150},{"$f":"EXP(-(2*L$9*(K42/1440)*(-G$8)/(Data!B$13^2*LN('B&R'!$J$12))))","v":1.4313752155978621E-14},null,{"$f":"$D$8","v":200},{"$f":"EXP(-(2*O$9*(N42/1440)*(-G$8))/(Data!B$13^2*LN('B&R'!$J$12)))","v":5.89525138146004E-10},null,{"$f":"$D$9","v":200},{"$f":"EXP(-(2*R$9*(Q42/1440)*(-G$8))/(Data!B$13^2*LN('B&R'!$J$12)))","v":2.0332975225557061E-4},null,{"$f":"$D$10","v":200},{"$f":"EXP(-(2*U$9*(T42/1440)*(-G$8))/(Data!B$13^2*LN('B&R'!J$12)))","v":1.4259374188777383E-2},null,{"$f":"$D$11","v":200},{"$f":"EXP(-(2*X$9*(W42/1440)*(-G$8))/(Data!B$13^2*LN('B&R'!$J$12)))","v":0.1194126215639594},null,{"$f":"$D$12","v":200},{"$f":"EXP(-(2*AA$9*(Z42/1440)*(-G$8))/(Data!B$13^2*LN('B&R'!$J$12)))","v":0.42738580455047337},null,{"$f":"$D$13","v":200},{"$f":"EXP(-(2*AD$9*(AC42/1440)*(-G$8))/(Data!B$13^2*LN('B&R'!$J$12)))","v":0.65374750825565164}]
[]
[]
[]
[]
[]
[]
["Field Data"]
[]
["Record Data in Fields Below",null,null,null,null,null,"Calculate and Plot Fields Below"]
["Well ID",null,"Well Dia. (ft)",null,"Total Depth (ft)"]
["Notes","Date","Time","Elapsed Time (min)","Depth To Product (TOC)","Depth to Water (TOC)","Product Thickness (ft)","Drawdown (s) DTP-DTP(initial) (ft)","Normalized Drawdown (s/sinitial)"]
["Initial Measurement"]
["Stopped Bailing/Start Gauging",null,null,0]
["Well Starts recovering"]

{"sheet":"Confined","index":7,"n_rows":19,"n_cols":13,"rows_kept":19,"cut":false,"hidden":true,"merged":[]}
["Confined LNAPL Model:",null,null,null,"Well Designation:",null,{"$f":"IF(Data!B1 > 0,Data!B1,\"\")","v":"YYY"}]
[null,null,null,null,"Date:",null,{"$f":"IF(Data!B2 > 0,Data!B2,\"\")","v":"date"}]
[]
[]
["Depth to base of confining bed (ft bgs) [from boring log]:",24.27]
["Constant LNAPL discharge to well (ft3/d):",3.53]
[]
[]
[null,null,null,null,null,null,null,null,null,null,null,{"$f":"Data!N24","v":2.0800000000000018},{"$f":"B6","v":3.53}]
[null,null,null,null,null,null,null,null,null,null,null,{"$f":"B14","v":4.0558974358974345},{"$f":"M9","v":3.53}]
["Depth to top of screen (ft bgs):",{"$f":"Data!B10","v":57},null,null,null,null,null,null,null,null,null,0,0]
["Corrected water table elevation (ft bgs):",{"$f":"Data!I21","v":62.168199999999999}]
["Limiting effective LNAPL thickness in well, bnW (ft):",{"$f":"IF(B5>B11,(B5-B12)/Data!B9,(B11-B12)/Data!B9)","v":-6.6258974358974339}]
["Limiting effective LNAPL drawdown, snW (ft):",{"$f":"(1-Data!B9)*(Confined!B15-Confined!B13)","v":4.0558974358974345}]
["Initial LNAPL thickness, bnR (ft):",{"$f":"Data!O21","v":11.809999999999995}]
["Radius of influence ratio (from Bouwer and Rice), R/rw:",{"$f":"'B&R'!J12","v":27.50099578256204}]
[]
[]
["LNAPL Transmissivity, Tn (ft2/d):",{"$f":"B6*LN(B16)/(2*PI()*(1-Data!B9)*(B15-B13))","v":0.45908118796121344}]

{"sheet":"Perched","index":8,"n_rows":18,"n_cols":13,"rows_kept":18,"cut":false,"hidden":true,"merged":[]}
["Perched LNAPL Model:",null,null,null,"Well Designation:",null,{"$f":"IF(Data!B1 > 0,Data!B1,\"\")","v":"YYY"}]
[null,null,null,null,"Date:",null,{"$f":"IF(Data!B2 > 0,Data!B2,\"\")","v":"date"}]
[]
[]
["Depth to top of perching layer, DZ12 (ft bgs):",22.63]
["Constant LNAPL discharge to well (ft3/d):",3.53]
[]
[]
[null,null,null,null,null,null,null,null,null,null,null,{"$f":"Data!N24","v":2.0800000000000018},{"$f":"B6","v":3.53}]
[null,null,null,null,null,null,null,null,null,null,null,{"$f":"B13","v":-36.94},{"$f":"M9","v":3.53}]
["Depth to top of screen (ft bgs):",{"$f":"Data!B10","v":57},null,null,null,null,null,null,null,null,null,0,0]
["Corrected water table elevation (ft bgs):",{"$f":"Data!I21","v":62.168199999999999}]
["Limiting effective LNAPL drawdown, snW (ft):",{"$f":"B5-B14","v":-36.94}]
["Initial depth to product (DTP0) (ft bgs):",{"$f":"Data!E21","v":59.57}]
["Radius of influence ratio (from Bouwer and Rice), R/rw:",{"$f":"'B&R'!J12","v":27.50099578256204}]
[]
[]
["LNAPL Transmissivity, Tn (ft2/d):",{"$f":"B6*LN(B15)/(2*PI()*B13)","v":-5.040569066379625E-2}]

{"sheet":"Flowchart","index":9,"n_rows":0,"n_cols":0,"rows_kept":0,"cut":false,"hidden":false,"merged":[]}